﻿2026-07-29T09:49:58.9910737Z Current runner version: '2.336.0'
2026-07-29T09:49:58.9915590Z Runner name: 'hfenduleam'
2026-07-29T09:49:58.9916074Z Runner group name: 'Default'
2026-07-29T09:49:58.9916642Z Machine name: 'HFENDULEAM'
2026-07-29T09:49:58.9920264Z ##[group]GITHUB_TOKEN Permissions
2026-07-29T09:49:58.9921759Z Actions: write
2026-07-29T09:49:58.9922084Z ArtifactMetadata: write
2026-07-29T09:49:58.9922444Z Attestations: write
2026-07-29T09:49:58.9922753Z Checks: write
2026-07-29T09:49:58.9923051Z CodeQuality: write
2026-07-29T09:49:58.9923370Z Contents: write
2026-07-29T09:49:58.9923712Z CopilotRequests: write
2026-07-29T09:49:58.9924092Z Deployments: write
2026-07-29T09:49:58.9925872Z Discussions: write
2026-07-29T09:49:58.9926619Z Drives: write
2026-07-29T09:49:58.9927110Z Issues: write
2026-07-29T09:49:58.9927543Z Metadata: read
2026-07-29T09:49:58.9927992Z Models: read
2026-07-29T09:49:58.9928446Z Packages: write
2026-07-29T09:49:58.9928896Z Pages: write
2026-07-29T09:49:58.9929678Z PullRequests: write
2026-07-29T09:49:58.9930291Z RepositoryProjects: write
2026-07-29T09:49:58.9930820Z SecurityEvents: write
2026-07-29T09:49:58.9931297Z Statuses: write
2026-07-29T09:49:58.9931758Z VulnerabilityAlerts: read
2026-07-29T09:49:58.9932230Z ##[endgroup]
2026-07-29T09:49:58.9934018Z Secret source: Actions
2026-07-29T09:49:58.9934937Z Prepare workflow directory
2026-07-29T09:49:59.0403831Z Prepare all required actions
2026-07-29T09:49:59.0449777Z Getting action download info
2026-07-29T09:49:59.3940604Z Download action repository 'actions/checkout@v5' (SHA:fbc6f3992d24b796d5a048ff273f7fcc4a7b6c09)
2026-07-29T09:50:00.1338595Z Complete job name: unit (self-hosted, Windows, hfenduleam)
2026-07-29T09:50:00.3319423Z ##[group]Run $floorBytes = 32GB
2026-07-29T09:50:00.3320169Z [36;1m$floorBytes = 32GB[0m
2026-07-29T09:50:00.3320647Z [36;1m$drive = (Get-Item $env:GITHUB_WORKSPACE).PSDrive[0m
2026-07-29T09:50:00.3321185Z [36;1m$freeBytes = [int64]$drive.Free[0m
2026-07-29T09:50:00.3322176Z [36;1mWrite-Host "disk preflight: drive=$($drive.Root) free_bytes=$freeBytes floor_bytes=$floorBytes"[0m
2026-07-29T09:50:00.3322933Z [36;1mif ($freeBytes -lt $floorBytes) {[0m
2026-07-29T09:50:00.3323656Z [36;1m  Write-Error "RESOURCE=disk drive=$($drive.Root) free_bytes=$freeBytes floor_bytes=$floorBytes"[0m
2026-07-29T09:50:00.3324354Z [36;1m  exit 1[0m
2026-07-29T09:50:00.3324723Z [36;1m}[0m
2026-07-29T09:50:00.3334547Z shell: C:\Program Files\PowerShell\7\pwsh.EXE -command ". '{0}'"
2026-07-29T09:50:00.3335323Z ##[endgroup]
2026-07-29T09:50:00.8711270Z disk preflight: drive=C:\ free_bytes=43196100608 floor_bytes=34359738368
2026-07-29T09:50:01.4314670Z ##[group]Run actions/checkout@v5
2026-07-29T09:50:01.4315840Z with:
2026-07-29T09:50:01.4316645Z   repository: BigscreenVR/spt-bs-core
2026-07-29T09:50:01.4339398Z   token: ***
2026-07-29T09:50:01.4344829Z   ssh-strict: true
2026-07-29T09:50:01.4347471Z   ssh-user: git
2026-07-29T09:50:01.4348329Z   persist-credentials: true
2026-07-29T09:50:01.4349321Z   clean: true
2026-07-29T09:50:01.4350163Z   sparse-checkout-cone-mode: true
2026-07-29T09:50:01.4351161Z   fetch-depth: 1
2026-07-29T09:50:01.4351939Z   fetch-tags: false
2026-07-29T09:50:01.4352801Z   show-progress: true
2026-07-29T09:50:01.4353932Z   lfs: false
2026-07-29T09:50:01.4354756Z   submodules: false
2026-07-29T09:50:01.4355584Z   set-safe-directory: true
2026-07-29T09:50:01.4356603Z   allow-unsafe-pr-checkout: false
2026-07-29T09:50:01.4357592Z ##[endgroup]
2026-07-29T09:50:01.8319729Z Syncing repository: BigscreenVR/spt-bs-core
2026-07-29T09:50:01.8321846Z ##[group]Getting Git version info
2026-07-29T09:50:01.8322904Z Working directory is 'C:\actions-runner\_work\spt-bs-core\spt-bs-core'
2026-07-29T09:50:01.8555543Z [command]"C:\Program Files\Git\cmd\git.exe" version
2026-07-29T09:50:01.8822141Z git version 2.43.0.windows.1
2026-07-29T09:50:01.8845666Z ##[endgroup]
2026-07-29T09:50:01.8854240Z Copying 'C:\Users\decid\.gitconfig' to 'C:\actions-runner\_work\_temp\22e74e98-ae04-4a86-9814-8a38d1f82cb3\.gitconfig'
2026-07-29T09:50:01.8870307Z Temporarily overriding HOME='C:\actions-runner\_work\_temp\22e74e98-ae04-4a86-9814-8a38d1f82cb3' before making global git config changes
2026-07-29T09:50:01.8872121Z Adding repository directory to the temporary git global config as a safe directory
2026-07-29T09:50:01.8877454Z [command]"C:\Program Files\Git\cmd\git.exe" config --global --add safe.directory C:\actions-runner\_work\spt-bs-core\spt-bs-core
2026-07-29T09:50:01.9198722Z [command]"C:\Program Files\Git\cmd\git.exe" config --local --get remote.origin.url
2026-07-29T09:50:01.9452569Z https://github.com/BigscreenVR/spt-bs-core
2026-07-29T09:50:01.9482293Z ##[group]Removing previously created refs, to avoid conflicts
2026-07-29T09:50:01.9488903Z [command]"C:\Program Files\Git\cmd\git.exe" rev-parse --symbolic-full-name --verify --quiet HEAD
2026-07-29T09:50:01.9752104Z refs/heads/main
2026-07-29T09:50:01.9779850Z [command]"C:\Program Files\Git\cmd\git.exe" checkout --detach
2026-07-29T09:50:02.0465806Z HEAD is now at ffc7e9ea Merge pull request #118 from BigscreenVR/docs/access-control-grill
2026-07-29T09:50:02.1455797Z ##[endgroup]
2026-07-29T09:50:02.1458725Z [command]"C:\Program Files\Git\cmd\git.exe" submodule status
2026-07-29T09:50:02.8329590Z ##[group]Cleaning the repository
2026-07-29T09:50:02.8333945Z [command]"C:\Program Files\Git\cmd\git.exe" clean -ffdx
2026-07-29T09:50:13.2103238Z Removing .adapter-notify/
2026-07-29T09:50:13.2103723Z Removing target/
2026-07-29T09:50:13.2150022Z [command]"C:\Program Files\Git\cmd\git.exe" reset --hard HEAD
2026-07-29T09:50:13.3283216Z HEAD is now at ffc7e9ea Merge pull request #118 from BigscreenVR/docs/access-control-grill
2026-07-29T09:50:13.3314991Z ##[endgroup]
2026-07-29T09:50:13.3319647Z ##[group]Disabling automatic garbage collection
2026-07-29T09:50:13.3324703Z [command]"C:\Program Files\Git\cmd\git.exe" config --local gc.auto 0
2026-07-29T09:50:13.4312591Z ##[endgroup]
2026-07-29T09:50:13.4312971Z ##[group]Setting up auth
2026-07-29T09:50:13.4319523Z [command]"C:\Program Files\Git\cmd\git.exe" config --local --name-only --get-regexp core\.sshCommand
2026-07-29T09:50:13.4567356Z [command]"C:\Program Files\Git\cmd\git.exe" submodule foreach --recursive "sh -c \"git config --local --name-only --get-regexp 'core\.sshCommand' && git config --local --unset-all 'core.sshCommand' || :\""
2026-07-29T09:50:14.8404515Z [command]"C:\Program Files\Git\cmd\git.exe" config --local --name-only --get-regexp http\.https\:\/\/github\.com\/\.extraheader
2026-07-29T09:50:14.8659952Z [command]"C:\Program Files\Git\cmd\git.exe" submodule foreach --recursive "sh -c \"git config --local --name-only --get-regexp 'http\.https\:\/\/github\.com\/\.extraheader' && git config --local --unset-all 'http.https://github.com/.extraheader' || :\""
2026-07-29T09:50:16.8559313Z [command]"C:\Program Files\Git\cmd\git.exe" config --local --name-only --get-regexp ^includeIf\.gitdir:
2026-07-29T09:50:16.8868728Z [command]"C:\Program Files\Git\cmd\git.exe" submodule foreach --recursive "git config --local --show-origin --name-only --get-regexp remote.origin.url"
2026-07-29T09:50:17.4797768Z [command]"C:\Program Files\Git\cmd\git.exe" config --local http.https://github.com/.extraheader "AUTHORIZATION: basic ***"
2026-07-29T09:50:17.5215073Z ##[endgroup]
2026-07-29T09:50:17.5215451Z ##[group]Fetching the repository
2026-07-29T09:50:17.5223009Z [command]"C:\Program Files\Git\cmd\git.exe" -c protocol.version=2 fetch --no-tags --prune --no-recurse-submodules --depth=1 origin +5aa12467744869a73922a65d1ce611bedb49e576:refs/remotes/pull/119/merge
2026-07-29T09:50:19.2203348Z From https://github.com/BigscreenVR/spt-bs-core
2026-07-29T09:50:19.2203862Z  * [new ref]           5aa12467744869a73922a65d1ce611bedb49e576 -> pull/119/merge
2026-07-29T09:50:19.2781330Z ##[endgroup]
2026-07-29T09:50:19.2781752Z ##[group]Determining the checkout info
2026-07-29T09:50:19.2783702Z ##[endgroup]
2026-07-29T09:50:19.2791528Z [command]"C:\Program Files\Git\cmd\git.exe" sparse-checkout disable
2026-07-29T09:50:19.4372461Z [command]"C:\Program Files\Git\cmd\git.exe" config --local --unset-all extensions.worktreeConfig
2026-07-29T09:50:19.7194273Z ##[group]Checking out the ref
2026-07-29T09:50:19.7202147Z [command]"C:\Program Files\Git\cmd\git.exe" checkout --progress --force refs/remotes/pull/119/merge
2026-07-29T09:50:20.1505730Z Previous HEAD position was ffc7e9ea Merge pull request #118 from BigscreenVR/docs/access-control-grill
2026-07-29T09:50:20.1506671Z HEAD is now at 5aa12467 Merge b1801eab79e7c4cf5bbf665abdda9b5e468e83d9 into ffc7e9ea4427ff56f02edd6816b814cea5874dfe
2026-07-29T09:50:20.1544456Z ##[endgroup]
2026-07-29T09:50:20.7266151Z [command]"C:\Program Files\Git\cmd\git.exe" log -1 --format=%H
2026-07-29T09:50:21.0162245Z 5aa12467744869a73922a65d1ce611bedb49e576
2026-07-29T09:50:21.1839545Z ##[group]Run cargo test --workspace --lib --bins
2026-07-29T09:50:21.1840080Z [36;1mcargo test --workspace --lib --bins[0m
2026-07-29T09:50:21.1848408Z shell: C:\Program Files\PowerShell\7\pwsh.EXE -command ". '{0}'"
2026-07-29T09:50:21.1848821Z ##[endgroup]
2026-07-29T09:50:26.7387817Z    Compiling proc-macro2 v1.0.106
2026-07-29T09:50:26.7388245Z    Compiling quote v1.0.45
2026-07-29T09:50:26.7388546Z    Compiling unicode-ident v1.0.24
2026-07-29T09:50:26.7388890Z    Compiling cfg-if v1.0.4
2026-07-29T09:50:26.7389249Z    Compiling serde_core v1.0.228
2026-07-29T09:50:26.7389768Z    Compiling serde v1.0.228
2026-07-29T09:50:26.7390125Z    Compiling windows-link v0.2.1
2026-07-29T09:50:26.7390456Z    Compiling portable-atomic v1.13.1
2026-07-29T09:50:26.7390811Z    Compiling typenum v1.20.1
2026-07-29T09:50:26.7391115Z    Compiling getrandom v0.3.4
2026-07-29T09:50:26.7394832Z    Compiling version_check v0.9.5
2026-07-29T09:50:26.7395405Z    Compiling critical-section v1.2.0
2026-07-29T09:50:26.7395765Z    Compiling find-msvc-tools v0.1.9
2026-07-29T09:50:26.7416111Z    Compiling shlex v2.0.1
2026-07-29T09:50:26.7417668Z    Compiling memchr v2.8.1
2026-07-29T09:50:26.7420245Z    Compiling subtle v2.6.1
2026-07-29T09:50:26.8739130Z    Compiling windows-sys v0.61.2
2026-07-29T09:50:26.9178558Z    Compiling equivalent v1.0.2
2026-07-29T09:50:26.9946371Z    Compiling smallvec v1.15.1
2026-07-29T09:50:27.0616685Z    Compiling semver v1.0.28
2026-07-29T09:50:27.2158181Z    Compiling itoa v1.0.18
2026-07-29T09:50:27.2417611Z    Compiling pin-project-lite v0.2.17
2026-07-29T09:50:27.3039583Z    Compiling rand_core v0.10.1
2026-07-29T09:50:27.3720339Z    Compiling generic-array v0.14.7
2026-07-29T09:50:27.5063397Z    Compiling rustc_version v0.4.1
2026-07-29T09:50:27.5314379Z    Compiling getrandom v0.4.2
2026-07-29T09:50:27.5826850Z    Compiling getrandom v0.2.17
2026-07-29T09:50:27.6419682Z    Compiling cpufeatures v0.2.17
2026-07-29T09:50:27.6525439Z    Compiling hashbrown v0.17.1
2026-07-29T09:50:27.8406997Z    Compiling futures-core v0.3.32
2026-07-29T09:50:27.9820660Z    Compiling bytes v1.11.1
2026-07-29T09:50:28.0848044Z    Compiling stable_deref_trait v1.2.1
2026-07-29T09:50:28.0871032Z    Compiling log v0.4.32
2026-07-29T09:50:28.1218169Z    Compiling futures-io v0.3.32
2026-07-29T09:50:28.1407329Z    Compiling futures-sink v0.3.32
2026-07-29T09:50:28.1434061Z    Compiling slab v0.4.12
2026-07-29T09:50:28.1721963Z    Compiling futures-task v0.3.32
2026-07-29T09:50:28.2340080Z    Compiling rustversion v1.0.22
2026-07-29T09:50:28.3882382Z    Compiling jobserver v0.1.34
2026-07-29T09:50:28.4127155Z    Compiling futures-channel v0.3.32
2026-07-29T09:50:28.4246601Z    Compiling bitflags v2.12.1
2026-07-29T09:50:28.4945818Z    Compiling libc v0.2.186
2026-07-29T09:50:28.4946575Z    Compiling winapi v0.3.9
2026-07-29T09:50:28.4946855Z    Compiling fnv v1.0.7
2026-07-29T09:50:28.5054069Z    Compiling autocfg v1.5.1
2026-07-29T09:50:28.5325133Z    Compiling strsim v0.11.1
2026-07-29T09:50:28.7321720Z    Compiling cc v1.2.63
2026-07-29T09:50:28.7380813Z    Compiling indexmap v2.14.0
2026-07-29T09:50:28.8744238Z    Compiling cfg_aliases v0.2.1
2026-07-29T09:50:28.9016244Z    Compiling curve25519-dalek v4.1.3
2026-07-29T09:50:28.9054385Z    Compiling zerocopy v0.8.50
2026-07-29T09:50:29.0614448Z    Compiling syn v2.0.117
2026-07-29T09:50:29.1039462Z    Compiling writeable v0.6.3
2026-07-29T09:50:29.1437698Z    Compiling crypto-common v0.1.7
2026-07-29T09:50:29.2683360Z    Compiling block-buffer v0.10.4
2026-07-29T09:50:29.3075537Z    Compiling litemap v0.8.2
2026-07-29T09:50:29.3109605Z    Compiling rand_core v0.6.4
2026-07-29T09:50:29.3577621Z    Compiling ahash v0.8.12
2026-07-29T09:50:29.3608633Z    Compiling ident_case v1.0.1
2026-07-29T09:50:29.4350430Z    Compiling dunce v1.0.5
2026-07-29T09:50:29.5039438Z    Compiling digest v0.10.7
2026-07-29T09:50:29.5739378Z    Compiling icu_normalizer_data v2.2.0
2026-07-29T09:50:29.6406698Z    Compiling icu_properties_data v2.2.0
2026-07-29T09:50:29.6839376Z    Compiling utf8_iter v1.0.4
2026-07-29T09:50:29.7850577Z    Compiling cmake v0.1.58
2026-07-29T09:50:29.8325704Z    Compiling fs_extra v1.3.0
2026-07-29T09:50:29.8377510Z    Compiling uuid v1.23.2
2026-07-29T09:50:29.8724817Z    Compiling sha2 v0.10.9
2026-07-29T09:50:29.9411698Z    Compiling signature v2.2.0
2026-07-29T09:50:30.0970015Z    Compiling pkg-config v0.3.33
2026-07-29T09:50:30.2399114Z    Compiling zmij v1.0.21
2026-07-29T09:50:30.2472111Z    Compiling vcpkg v0.2.15
2026-07-29T09:50:30.3288704Z    Compiling ed25519 v2.2.3
2026-07-29T09:50:30.3751515Z    Compiling percent-encoding v2.3.2
2026-07-29T09:50:30.3767729Z    Compiling serde_json v1.0.150
2026-07-29T09:50:30.5641548Z    Compiling fastrand v2.4.1
2026-07-29T09:50:30.6222288Z    Compiling http v1.4.1
2026-07-29T09:50:30.6958252Z    Compiling cpufeatures v0.3.0
2026-07-29T09:50:30.6958796Z    Compiling aws-lc-rs v1.17.0
2026-07-29T09:50:30.7215913Z    Compiling windows_x86_64_msvc v0.52.6
2026-07-29T09:50:30.7563470Z    Compiling thiserror v2.0.18
2026-07-29T09:50:30.8995724Z    Compiling aws-lc-sys v0.41.0
2026-07-29T09:50:30.9035880Z    Compiling ring v0.17.14
2026-07-29T09:50:30.9226139Z    Compiling unicode-segmentation v1.13.3
2026-07-29T09:50:30.9307263Z    Compiling fallible-streaming-iterator v0.1.9
2026-07-29T09:50:31.2082090Z    Compiling scopeguard v1.2.0
2026-07-29T09:50:31.3403156Z    Compiling fallible-iterator v0.3.0
2026-07-29T09:50:31.3926316Z    Compiling chacha20 v0.10.0
2026-07-29T09:50:31.4237547Z    Compiling form_urlencoded v1.2.2
2026-07-29T09:50:31.4678724Z    Compiling libsqlite3-sys v0.30.1
2026-07-29T09:50:31.5988044Z    Compiling lock_api v0.4.14
2026-07-29T09:50:31.6659709Z    Compiling untrusted v0.9.0
2026-07-29T09:50:31.8108898Z    Compiling windows-targets v0.52.6
2026-07-29T09:50:31.8528639Z    Compiling rand v0.10.1
2026-07-29T09:50:31.8529022Z    Compiling num-traits v0.2.19
2026-07-29T09:50:31.8686210Z    Compiling windows-strings v0.5.1
2026-07-29T09:50:31.9225762Z    Compiling windows-result v0.4.1
2026-07-29T09:50:32.0178007Z    Compiling anyhow v1.0.102
2026-07-29T09:50:32.1076040Z    Compiling fs2 v0.4.3
2026-07-29T09:50:32.1247353Z    Compiling rustls v0.23.40
2026-07-29T09:50:32.2165691Z    Compiling heck v0.5.0
2026-07-29T09:50:32.2228633Z    Compiling windows-sys v0.59.0
2026-07-29T09:50:32.5209022Z    Compiling convert_case v0.10.0
2026-07-29T09:50:32.5554919Z    Compiling const-oid v0.10.2
2026-07-29T09:50:32.5887214Z    Compiling unicode-xid v0.2.6
2026-07-29T09:50:32.5900270Z    Compiling atomic-waker v1.1.2
2026-07-29T09:50:32.5901535Z    Compiling parking_lot_core v0.9.12
2026-07-29T09:50:32.8737512Z    Compiling httparse v1.10.1
2026-07-29T09:50:33.2816030Z    Compiling synstructure v0.13.2
2026-07-29T09:50:33.3220736Z    Compiling darling_core v0.20.11
2026-07-29T09:50:33.4219594Z    Compiling http-body v1.0.1
2026-07-29T09:50:33.6164503Z    Compiling hybrid-array v0.4.12
2026-07-29T09:50:33.6844034Z    Compiling either v1.16.0
2026-07-29T09:50:33.7266348Z    Compiling powerfmt v0.2.0
2026-07-29T09:50:33.9878365Z    Compiling base64ct v1.8.3
2026-07-29T09:50:34.0497215Z    Compiling deranged v0.5.8
2026-07-29T09:50:34.2888776Z    Compiling tower-service v0.3.3
2026-07-29T09:50:34.3565368Z    Compiling pem-rfc7468 v1.0.0
2026-07-29T09:50:34.3565892Z    Compiling ref-cast v1.0.25
2026-07-29T09:50:34.4093407Z    Compiling num-conv v0.2.2
2026-07-29T09:50:34.4827154Z    Compiling base64 v0.22.1
2026-07-29T09:50:34.5204423Z    Compiling try-lock v0.2.5
2026-07-29T09:50:34.5529313Z    Compiling time-core v0.1.8
2026-07-29T09:50:34.5619716Z    Compiling tinyvec_macros v0.1.1
2026-07-29T09:50:34.6051305Z    Compiling data-encoding v2.11.0
2026-07-29T09:50:34.6851108Z    Compiling want v0.3.1
2026-07-29T09:50:34.7414801Z    Compiling tinyvec v1.11.0
2026-07-29T09:50:34.7893764Z    Compiling parking_lot v0.12.5
2026-07-29T09:50:34.7898088Z    Compiling crypto-common v0.2.2
2026-07-29T09:50:34.8352591Z    Compiling block-buffer v0.12.0
2026-07-29T09:50:34.8867103Z    Compiling serde_derive_internals v0.29.1
2026-07-29T09:50:34.9088518Z    Compiling vergen-lib v9.1.0
2026-07-29T09:50:35.0373818Z    Compiling inout v0.1.4
2026-07-29T09:50:35.1260111Z    Compiling n0-future v0.3.2
2026-07-29T09:50:35.2060827Z    Compiling aho-corasick v1.1.4
2026-07-29T09:50:35.2681765Z    Compiling toml_write v0.1.2
2026-07-29T09:50:35.2682585Z    Compiling winnow v0.7.15
2026-07-29T09:50:35.4306861Z    Compiling httpdate v1.0.3
2026-07-29T09:50:35.5394823Z    Compiling spin v0.10.0
2026-07-29T09:50:35.5636888Z    Compiling regex-syntax v0.8.10
2026-07-29T09:50:35.5637354Z    Compiling diatomic-waker v0.2.3
2026-07-29T09:50:35.5936022Z    Compiling crossbeam-utils v0.8.21
2026-07-29T09:50:35.6794617Z    Compiling parking v2.2.1
2026-07-29T09:50:35.7620530Z    Compiling cordyceps v0.3.4
2026-07-29T09:50:35.8668800Z    Compiling winnow v1.0.3
2026-07-29T09:50:35.9159900Z    Compiling futures-lite v2.6.1
2026-07-29T09:50:36.0158651Z    Compiling digest v0.11.3
2026-07-29T09:50:36.1134409Z    Compiling futures-buffered v0.2.13
2026-07-29T09:50:36.1165652Z    Compiling socket2 v0.6.4
2026-07-29T09:50:36.1629431Z    Compiling mio v1.2.1
2026-07-29T09:50:36.2859498Z    Compiling serde_derive v1.0.228
2026-07-29T09:50:36.3747026Z    Compiling zeroize_derive v1.4.3
2026-07-29T09:50:36.4465270Z    Compiling zerofrom-derive v0.1.7
2026-07-29T09:50:36.5825990Z    Compiling yoke-derive v0.8.2
2026-07-29T09:50:36.6604100Z    Compiling tokio-macros v2.7.0
2026-07-29T09:50:36.7719531Z    Compiling curve25519-dalek-derive v0.1.1
2026-07-29T09:50:36.8123436Z    Compiling futures-macro v0.3.32
2026-07-29T09:50:36.9319061Z    Compiling zerovec-derive v0.11.3
2026-07-29T09:50:37.2381617Z    Compiling displaydoc v0.2.6
2026-07-29T09:50:37.5385488Z    Compiling tracing-attributes v0.1.31
2026-07-29T09:50:37.5874377Z    Compiling zeroize v1.8.2
2026-07-29T09:50:37.6402379Z    Compiling tokio v1.52.3
2026-07-29T09:50:37.6457405Z    Compiling thiserror-impl v2.0.18
2026-07-29T09:50:37.7343107Z    Compiling darling_macro v0.20.11
2026-07-29T09:50:37.8961040Z    Compiling futures-util v0.3.32
2026-07-29T09:50:38.3580544Z    Compiling rustls-pki-types v1.14.1
2026-07-29T09:50:38.6394988Z    Compiling derive_more-impl v2.1.1
2026-07-29T09:50:38.6602103Z    Compiling windows-implement v0.60.2
2026-07-29T09:50:38.7677224Z    Compiling windows-interface v0.59.3
2026-07-29T09:50:38.8561782Z    Compiling spez v0.1.2
2026-07-29T09:50:38.9752970Z    Compiling zerofrom v0.1.8
2026-07-29T09:50:39.1114426Z    Compiling darling v0.20.11
2026-07-29T09:50:39.1896154Z    Compiling n0-error-macros v0.1.3
2026-07-29T09:50:39.2781456Z    Compiling yoke v0.8.3
2026-07-29T09:50:39.2875374Z    Compiling der v0.8.0-rc.10
2026-07-29T09:50:39.7384619Z    Compiling ed25519-dalek v2.2.0
2026-07-29T09:50:39.7883335Z    Compiling derive_builder_core v0.20.2
2026-07-29T09:50:39.8221352Z    Compiling zerovec v0.11.6
2026-07-29T09:50:39.8274907Z    Compiling zerotrie v0.2.4
2026-07-29T09:50:39.8847042Z    Compiling windows-core v0.62.2
2026-07-29T09:50:40.1720546Z    Compiling spt-proto v0.45.0 (C:\actions-runner\_work\spt-bs-core\spt-bs-core\crates\spt-proto)
2026-07-29T09:50:40.1810974Z    Compiling ref-cast-impl v1.0.25
2026-07-29T09:50:40.2025557Z    Compiling pin-project-internal v1.1.13
2026-07-29T09:50:40.4338336Z    Compiling regex-automata v0.4.14
2026-07-29T09:50:40.6310607Z    Compiling tinystr v0.8.3
2026-07-29T09:50:40.6311053Z    Compiling potential_utf v0.1.5
2026-07-29T09:50:40.8824690Z    Compiling icu_locale_core v2.2.0
2026-07-29T09:50:40.9160326Z    Compiling icu_collections v2.2.0
2026-07-29T09:50:40.9664183Z    Compiling n0-error v0.1.3
2026-07-29T09:50:40.9664581Z    Compiling spki v0.8.0-rc.4
2026-07-29T09:50:41.2320532Z    Compiling derive_builder_macro v0.20.2
2026-07-29T09:50:41.3127513Z    Compiling toml_parser v1.1.2+spec-1.1.0
2026-07-29T09:50:41.3331045Z    Compiling schemars_derive v1.2.1
2026-07-29T09:50:41.8128952Z    Compiling cipher v0.4.4
2026-07-29T09:50:41.8167450Z    Compiling derive_builder v0.20.2
2026-07-29T09:50:41.8975812Z    Compiling icu_provider v2.2.0
2026-07-29T09:50:41.9739673Z    Compiling ipnet v2.12.0
2026-07-29T09:50:41.9964977Z    Compiling serde_spanned v0.6.9
2026-07-29T09:50:42.1278947Z    Compiling toml_datetime v0.6.11
2026-07-29T09:50:42.2403706Z    Compiling tokio-util v0.7.18
2026-07-29T09:50:42.2404151Z    Compiling icu_normalizer v2.2.0
2026-07-29T09:50:42.2441958Z    Compiling icu_properties v2.2.0
2026-07-29T09:50:42.2755720Z    Compiling pin-project v1.1.13
2026-07-29T09:50:42.2757206Z    Compiling vergen-lib v0.1.6
2026-07-29T09:50:42.4865507Z    Compiling toml_edit v0.22.27
2026-07-29T09:50:42.5824408Z    Compiling once_cell v1.21.4
2026-07-29T09:50:42.6085464Z    Compiling vergen v9.1.0
2026-07-29T09:50:42.6462068Z    Compiling universal-hash v0.5.1
2026-07-29T09:50:42.7830847Z    Compiling noq-udp v0.10.0
2026-07-29T09:50:42.8247383Z    Compiling sync_wrapper v1.0.2
2026-07-29T09:50:42.8247865Z    Compiling curve25519-dalek v5.0.0-pre.6
2026-07-29T09:50:42.8846251Z    Compiling heapless v0.7.17
2026-07-29T09:50:42.9831146Z    Compiling tracing-core v0.1.36
2026-07-29T09:50:43.0254335Z    Compiling opaque-debug v0.3.1
2026-07-29T09:50:43.0614881Z    Compiling byteorder v1.5.0
2026-07-29T09:50:43.1604688Z    Compiling toml_datetime v1.1.1+spec-1.1.0
2026-07-29T09:50:43.2695022Z    Compiling hashbrown v0.14.5
2026-07-29T09:50:43.3496211Z    Compiling dyn-clone v1.0.20
2026-07-29T09:50:43.3682221Z    Compiling allocator-api2 v0.2.21
2026-07-29T09:50:43.3966192Z    Compiling tracing v0.1.44
2026-07-29T09:50:43.5229099Z    Compiling idna_adapter v1.2.2
2026-07-29T09:50:43.5708602Z    Compiling toml_edit v0.25.12+spec-1.1.0
2026-07-29T09:50:43.7224874Z    Compiling hash32 v0.2.1
2026-07-29T09:50:43.7777893Z    Compiling polyval v0.6.2
2026-07-29T09:50:43.8316469Z    Compiling idna v1.1.0
2026-07-29T09:50:43.8725454Z    Compiling schemars v1.2.1
2026-07-29T09:50:43.9003582Z    Compiling derive_more v2.1.1
2026-07-29T09:50:43.9317555Z    Compiling h2 v0.4.14
2026-07-29T09:50:43.9640692Z    Compiling hashlink v0.9.1
2026-07-29T09:50:44.0778575Z    Compiling regex v1.12.3
2026-07-29T09:50:44.1037487Z    Compiling prefix-trie v0.8.4
2026-07-29T09:50:44.1105721Z    Compiling futures-executor v0.3.32
2026-07-29T09:50:44.1366392Z    Compiling pkcs8 v0.11.0-rc.10
2026-07-29T09:50:44.2218838Z    Compiling url v2.5.8
2026-07-29T09:50:44.3541728Z    Compiling rusqlite v0.32.1
2026-07-29T09:50:44.4066016Z    Compiling toml v0.8.23
2026-07-29T09:50:44.5599354Z    Compiling spin v0.9.8
2026-07-29T09:50:44.5754634Z    Compiling vergen-gitcl v1.0.8
2026-07-29T09:50:44.7760336Z    Compiling hmac v0.12.1
2026-07-29T09:50:44.8476933Z    Compiling windows-threading v0.2.1
2026-07-29T09:50:44.9459245Z    Compiling ryu v1.0.23
2026-07-29T09:50:44.9459756Z    Compiling tower-layer v0.3.3
2026-07-29T09:50:45.0375503Z    Compiling arrayvec v0.7.6
2026-07-29T09:50:45.1589252Z    Compiling signature v3.0.0
2026-07-29T09:50:45.2935418Z    Compiling spt-store v0.45.0 (C:\actions-runner\_work\spt-bs-core\spt-bs-core\crates\spt-store)
2026-07-29T09:50:45.2937338Z    Compiling ed25519 v3.0.0-rc.4
2026-07-29T09:50:45.3107483Z    Compiling windows-future v0.3.2
2026-07-29T09:50:45.3430537Z    Compiling hickory-proto v0.26.0-beta.4
2026-07-29T09:50:45.5029479Z    Compiling proc-macro-crate v3.5.0
2026-07-29T09:50:45.6032737Z    Compiling futures v0.3.32
2026-07-29T09:50:45.7570884Z    Compiling ghash v0.5.1
2026-07-29T09:50:46.0464210Z    Compiling data-encoding-macro-internal v0.1.18
2026-07-29T09:50:46.0564764Z    Compiling aes v0.8.4
2026-07-29T09:50:46.1503308Z    Compiling ctr v0.9.2
2026-07-29T09:50:46.2062394Z    Compiling windows-collections v0.3.2
2026-07-29T09:50:46.2358308Z    Compiling windows-numerics v0.3.1
2026-07-29T09:50:46.2358769Z    Compiling cobs v0.3.0
2026-07-29T09:50:46.4154776Z    Compiling postcard-derive v0.2.2
2026-07-29T09:50:46.4462470Z    Compiling sha2 v0.11.0-rc.5
2026-07-29T09:50:46.5663963Z    Compiling time v0.3.47
2026-07-29T09:50:46.5761609Z    Compiling http-body-util v0.1.3
2026-07-29T09:50:46.7828608Z    Compiling aead v0.5.2
2026-07-29T09:50:46.8048056Z    Compiling ipconfig v0.3.4
2026-07-29T09:50:46.8598682Z    Compiling widestring v1.2.1
2026-07-29T09:50:46.9629064Z    Compiling utf8parse v0.2.2
2026-07-29T09:50:46.9629507Z    Compiling aes-gcm v0.10.3
2026-07-29T09:50:46.9900834Z    Compiling windows v0.62.2
2026-07-29T09:50:47.1013202Z    Compiling data-encoding-macro v0.1.20
2026-07-29T09:50:47.1655817Z    Compiling num_enum_derive v0.7.6
2026-07-29T09:50:47.2171072Z    Compiling postcard v1.1.3
2026-07-29T09:50:47.4004165Z    Compiling ed25519-dalek v3.0.0-pre.6
2026-07-29T09:50:47.4439577Z    Compiling tower v0.5.3
2026-07-29T09:50:47.5373700Z    Compiling crossbeam-epoch v0.9.18
2026-07-29T09:50:47.7391663Z    Compiling crossbeam-channel v0.5.15
2026-07-29T09:50:47.7840165Z    Compiling tempfile v3.27.0
2026-07-29T09:50:47.8842290Z    Compiling chrono v0.4.45
2026-07-29T09:50:47.9532858Z    Compiling async-trait v0.1.89
2026-07-29T09:50:48.0501014Z    Compiling hyper v1.10.1
2026-07-29T09:50:48.1038278Z    Compiling spt-msg v0.45.0 (C:\actions-runner\_work\spt-bs-core\spt-bs-core\crates\spt-msg)
2026-07-29T09:50:48.2234941Z    Compiling enum-assoc v1.3.0
2026-07-29T09:50:48.5458590Z    Compiling iroh-metrics-derive v0.4.1
2026-07-29T09:50:48.6355291Z    Compiling strum_macros v0.28.0
2026-07-29T09:50:48.7555440Z    Compiling windows-registry v0.6.1
2026-07-29T09:50:48.8220388Z    Compiling blake3 v1.8.5
2026-07-29T09:50:49.1029881Z    Compiling memoffset v0.6.5
2026-07-29T09:50:49.8659863Z    Compiling noq v0.18.0
2026-07-29T09:50:50.0519993Z    Compiling netwatch v0.16.0
2026-07-29T09:50:50.1774193Z    Compiling acto v0.8.2
2026-07-29T09:50:50.5836508Z    Compiling hyper-util v0.1.20
2026-07-29T09:50:50.8558806Z    Compiling spt-runtime v0.45.0 (C:\actions-runner\_work\spt-bs-core\spt-bs-core\crates\spt-runtime)
2026-07-29T09:50:50.9195824Z    Compiling rustc-hash v2.1.2
2026-07-29T09:50:50.9414932Z    Compiling thiserror v1.0.69
2026-07-29T09:50:50.9465659Z    Compiling foldhash v0.2.0
2026-07-29T09:50:50.9580615Z    Compiling identity-hash v0.1.0
2026-07-29T09:50:51.1076914Z    Compiling sorted-index-buffer v0.2.1
2026-07-29T09:50:51.1077402Z    Compiling xml-rs v0.8.28
2026-07-29T09:50:51.1186232Z    Compiling mac-addr v0.3.0
2026-07-29T09:50:51.1516194Z    Compiling lru-slab v0.1.2
2026-07-29T09:50:51.3636207Z    Compiling tagptr v0.2.0
2026-07-29T09:50:51.3636684Z    Compiling iroh-relay v0.98.0
2026-07-29T09:50:51.3990264Z    Compiling netdev v0.42.0
2026-07-29T09:50:51.4534718Z    Compiling hashbrown v0.16.1
2026-07-29T09:50:51.6906016Z    Compiling moka v0.12.15
2026-07-29T09:50:51.7316176Z    Compiling iroh-metrics v0.38.3
2026-07-29T09:50:52.0171942Z    Compiling xmltree v0.10.3
2026-07-29T09:50:52.2881460Z    Compiling num_enum v0.7.6
2026-07-29T09:50:52.3643671Z    Compiling tower-http v0.6.11
2026-07-29T09:50:52.3893695Z    Compiling iroh-base v0.98.0
2026-07-29T09:50:52.4222405Z    Compiling attohttpc v0.30.1
2026-07-29T09:50:52.6844751Z    Compiling n0-watcher v0.6.1
2026-07-29T09:50:52.8294215Z    Compiling tokio-stream v0.1.18
2026-07-29T09:50:52.8861338Z    Compiling thiserror-impl v1.0.69
2026-07-29T09:50:53.0532153Z    Compiling serial-core v0.4.0
2026-07-29T09:50:53.3114489Z    Compiling simple-dns v0.9.3
2026-07-29T09:50:53.3114931Z    Compiling resolv-conf v0.7.6
2026-07-29T09:50:53.3501796Z    Compiling sha1_smol v1.0.1
2026-07-29T09:50:53.5232100Z    Compiling winreg v0.10.1
2026-07-29T09:50:53.6272661Z    Compiling simdutf8 v0.1.5
2026-07-29T09:50:53.6825886Z    Compiling constant_time_eq v0.4.2
2026-07-29T09:50:53.6880649Z    Compiling arrayref v0.3.9
2026-07-29T09:50:53.8630201Z    Compiling smol_str v0.1.24
2026-07-29T09:50:53.8991572Z    Compiling strum v0.28.0
2026-07-29T09:50:53.8995719Z    Compiling serial-windows v0.4.0
2026-07-29T09:50:53.9038316Z    Compiling igd-next v0.17.1
2026-07-29T09:50:54.1712498Z    Compiling lru v0.16.4
2026-07-29T09:50:54.2080318Z    Compiling webpki-roots v1.0.7
2026-07-29T09:50:54.2456890Z    Compiling seize v0.5.1
2026-07-29T09:50:54.2731317Z    Compiling serde_bytes v0.11.19
2026-07-29T09:50:54.3851604Z    Compiling iroh v0.98.2
2026-07-29T09:50:54.4480870Z    Compiling cmov v0.5.4
2026-07-29T09:50:54.5467542Z    Compiling iroh-dns v0.98.0
2026-07-29T09:50:54.6408379Z    Compiling pin-utils v0.1.0
2026-07-29T09:50:54.7298779Z    Compiling bitflags v1.3.2
2026-07-29T09:50:54.7343820Z    Compiling lazy_static v1.5.0
2026-07-29T09:50:54.7838864Z    Compiling ctutils v0.4.2
2026-07-29T09:50:54.7839549Z    Compiling nix v0.25.1
2026-07-29T09:50:54.8126430Z    Compiling swarm-discovery v0.6.0-alpha.2
2026-07-29T09:50:54.8395628Z    Compiling shared_library v0.1.9
2026-07-29T09:50:54.8940991Z    Compiling filedescriptor v0.8.3
2026-07-29T09:50:54.8941522Z    Compiling papaya v0.2.4
2026-07-29T09:50:54.9100252Z    Compiling serial v0.4.0
2026-07-29T09:50:55.1168148Z    Compiling hkdf v0.12.4
2026-07-29T09:50:55.1634508Z    Compiling backon v1.6.0
2026-07-29T09:50:55.1703232Z    Compiling vte_generate_state_changes v0.1.2
2026-07-29T09:50:55.1980093Z    Compiling shell-words v1.1.1
2026-07-29T09:50:55.2110837Z    Compiling downcast-rs v1.2.1
2026-07-29T09:50:55.2954973Z    Compiling unicode-width v0.2.0
2026-07-29T09:50:55.3303517Z    Compiling spake2 v0.4.0
2026-07-29T09:50:55.3304032Z    Compiling sha1 v0.10.6
2026-07-29T09:50:55.4279869Z    Compiling portable-pty v0.8.1
2026-07-29T09:50:55.4746779Z    Compiling unicode-width v0.1.14
2026-07-29T09:50:55.5376080Z    Compiling doctest-file v1.1.1
2026-07-29T09:50:55.5607953Z    Compiling recvmsg v1.0.0
2026-07-29T09:50:55.6518884Z    Compiling spt-live v0.45.0 (C:\actions-runner\_work\spt-bs-core\spt-bs-core\crates\spt-live)
2026-07-29T09:50:55.7016191Z    Compiling vte v0.13.1
2026-07-29T09:50:55.7016695Z    Compiling darling_core v0.23.0
2026-07-29T09:50:55.7152531Z    Compiling once_cell_polyfill v1.70.2
2026-07-29T09:50:55.7980373Z    Compiling anstyle v1.0.14
2026-07-29T09:50:55.8802329Z    Compiling anstyle-parse v1.0.0
2026-07-29T09:50:55.8803551Z    Compiling anstyle-query v1.1.5
2026-07-29T09:50:56.0415209Z    Compiling instability v0.3.12
2026-07-29T09:50:56.1953316Z    Compiling anstyle-wincon v3.0.11
2026-07-29T09:50:56.1953732Z    Compiling foldhash v0.1.5
2026-07-29T09:50:56.2116709Z    Compiling paste v1.0.15
2026-07-29T09:50:56.2119938Z    Compiling interprocess v2.4.2
2026-07-29T09:50:56.4474417Z    Compiling colorchoice v1.0.5
2026-07-29T09:50:56.5707238Z    Compiling is_terminal_polyfill v1.70.2
2026-07-29T09:50:56.6500109Z    Compiling hashbrown v0.15.5
2026-07-29T09:50:56.7264458Z    Compiling spt-term v0.45.0 (C:\actions-runner\_work\spt-bs-core\spt-bs-core\crates\spt-term)
2026-07-29T09:50:56.7458589Z    Compiling anstream v1.0.0
2026-07-29T09:50:56.7861342Z    Compiling strum_macros v0.26.4
2026-07-29T09:50:56.8241236Z    Compiling terminal_size v0.4.4
2026-07-29T09:50:57.0198653Z    Compiling itertools v0.13.0
2026-07-29T09:50:57.0635461Z    Compiling crossterm_winapi v0.9.1
2026-07-29T09:50:57.1068779Z    Compiling castaway v0.2.4
2026-07-29T09:50:57.3349692Z    Compiling static_assertions v1.1.0
2026-07-29T09:50:57.3431322Z    Compiling bytemuck v1.25.2
2026-07-29T09:50:57.4222491Z    Compiling clap_lex v1.1.0
2026-07-29T09:50:57.4637381Z    Compiling indoc v2.0.7
2026-07-29T09:50:57.4909081Z    Compiling compact_str v0.8.2
2026-07-29T09:50:57.8056648Z    Compiling wmi v0.18.4
2026-07-29T09:50:57.8659278Z    Compiling rgb v0.8.53
2026-07-29T09:50:57.8659729Z    Compiling clap_builder v4.6.0
2026-07-29T09:50:58.1658729Z    Compiling crossterm v0.28.1
2026-07-29T09:50:58.2004972Z    Compiling lru v0.12.5
2026-07-29T09:50:58.3818294Z    Compiling clap_derive v4.6.1
2026-07-29T09:50:58.7475370Z    Compiling unicode-truncate v1.1.0
2026-07-29T09:50:58.9175286Z    Compiling cassowary v0.3.0
2026-07-29T09:50:59.0676230Z    Compiling strum v0.26.3
2026-07-29T09:50:59.0890389Z    Compiling error-code v3.3.2
2026-07-29T09:50:59.2316011Z    Compiling clipboard-win v5.4.1
2026-07-29T09:50:59.2564953Z    Compiling avt v0.18.0
2026-07-29T09:50:59.4376770Z    Compiling portmapper v0.16.0
2026-07-29T09:50:59.7407672Z    Compiling darling_macro v0.23.0
2026-07-29T09:50:59.8121617Z    Compiling spt-test-support v0.45.0 (C:\actions-runner\_work\spt-bs-core\spt-bs-core\crates\spt-test-support)
2026-07-29T09:50:59.9084345Z    Compiling nucleo-matcher v0.3.1
2026-07-29T09:50:59.9810096Z    Compiling qrcode v0.14.1
2026-07-29T09:51:00.3408731Z    Compiling darling v0.23.0
2026-07-29T09:51:01.0196957Z    Compiling clap v4.6.1
2026-07-29T09:51:01.7670777Z    Compiling ratatui v0.29.0
2026-07-29T09:51:05.1115745Z    Compiling mock-adapter v0.45.0 (C:\actions-runner\_work\spt-bs-core\spt-bs-core\adapters\mock)
2026-07-29T09:51:20.5713739Z    Compiling rustls-webpki v0.103.13
2026-07-29T09:51:24.0172361Z    Compiling tokio-rustls v0.26.4
2026-07-29T09:51:24.0172830Z    Compiling rustls-platform-verifier v0.7.0
2026-07-29T09:51:24.0173180Z    Compiling noq-proto v0.17.0
2026-07-29T09:51:24.4153171Z    Compiling hickory-net v0.26.0-beta.4
2026-07-29T09:51:24.4223245Z    Compiling hyper-rustls v0.27.9
2026-07-29T09:51:24.4236240Z    Compiling tokio-websockets v0.13.2
2026-07-29T09:51:28.1620243Z    Compiling hickory-resolver v0.26.0-beta.4
2026-07-29T09:51:29.8303003Z    Compiling reqwest v0.13.4
2026-07-29T09:52:13.5814019Z    Compiling spt-net v0.45.0 (C:\actions-runner\_work\spt-bs-core\spt-bs-core\crates\spt-net)
2026-07-29T09:52:16.3635827Z    Compiling spt-daemon v0.45.0 (C:\actions-runner\_work\spt-bs-core\spt-bs-core\crates\spt-daemon)
2026-07-29T09:52:34.1908060Z    Compiling spt v0.45.0 (C:\actions-runner\_work\spt-bs-core\spt-bs-core\crates\spt)
2026-07-29T09:52:34.1908906Z    Compiling xtask v0.45.0 (C:\actions-runner\_work\spt-bs-core\spt-bs-core\crates\xtask)
2026-07-29T09:52:47.3603981Z     Finished `test` profile [unoptimized + debuginfo] target(s) in 2m 25s
2026-07-29T09:52:47.3994695Z      Running unittests src\capture_player.rs (target\debug\deps\capture_player-4041a5d23c493935.exe)
2026-07-29T09:52:47.4901028Z 
2026-07-29T09:52:47.4902784Z running 2 tests
2026-07-29T09:52:47.4906142Z test tests::refuses_a_length_mismatch ... ok
2026-07-29T09:52:47.4906474Z test tests::parses_a_well_formed_record ... ok
2026-07-29T09:52:47.4906665Z 
2026-07-29T09:52:47.4906956Z test result: ok. 2 passed; 0 failed; 0 ignored; 0 measured; 0 filtered out; finished in 0.00s
2026-07-29T09:52:47.4907352Z 
2026-07-29T09:52:47.4915721Z      Running unittests src\console_mode_probe.rs (target\debug\deps\console_mode_probe-5546b6a912c0f138.exe)
2026-07-29T09:52:47.5726659Z 
2026-07-29T09:52:47.5727063Z running 0 tests
2026-07-29T09:52:47.5727231Z 
2026-07-29T09:52:47.5727556Z test result: ok. 0 passed; 0 failed; 0 ignored; 0 measured; 0 filtered out; finished in 0.00s
2026-07-29T09:52:47.5727816Z 
2026-07-29T09:52:47.5740558Z      Running unittests src\main.rs (target\debug\deps\mock_session-8f31747bb8b55190.exe)
2026-07-29T09:52:47.6767831Z 
2026-07-29T09:52:47.6769301Z running 0 tests
2026-07-29T09:52:47.6769556Z 
2026-07-29T09:52:47.6769883Z test result: ok. 0 passed; 0 failed; 0 ignored; 0 measured; 0 filtered out; finished in 0.00s
2026-07-29T09:52:47.6770327Z 
2026-07-29T09:52:47.6782264Z      Running unittests src\shell.rs (target\debug\deps\mock_shell-02933291fe718159.exe)
2026-07-29T09:52:47.7783670Z 
2026-07-29T09:52:47.7784151Z running 0 tests
2026-07-29T09:52:47.7784340Z 
2026-07-29T09:52:47.7784673Z test result: ok. 0 passed; 0 failed; 0 ignored; 0 measured; 0 filtered out; finished in 0.00s
2026-07-29T09:52:47.7785034Z 
2026-07-29T09:52:47.7831281Z      Running unittests tests\fixtures\gh_fixture.rs (target\debug\deps\gh_fixture-3c229eadbec9b8c9.exe)
2026-07-29T09:52:47.8577916Z 
2026-07-29T09:52:47.8578314Z running 0 tests
2026-07-29T09:52:47.8578704Z 
2026-07-29T09:52:47.8578931Z test result: ok. 0 passed; 0 failed; 0 ignored; 0 measured; 0 filtered out; finished in 0.00s
2026-07-29T09:52:47.8579219Z 
2026-07-29T09:52:47.8589590Z      Running unittests tests\fixtures\git_fixture.rs (target\debug\deps\git_fixture-1ea8518c85582f21.exe)
2026-07-29T09:52:47.9441085Z 
2026-07-29T09:52:47.9441501Z running 0 tests
2026-07-29T09:52:47.9441714Z 
2026-07-29T09:52:47.9442042Z test result: ok. 0 passed; 0 failed; 0 ignored; 0 measured; 0 filtered out; finished in 0.00s
2026-07-29T09:52:47.9442474Z 
2026-07-29T09:52:47.9452859Z      Running unittests tests\fixtures\post_step_fixture.rs (target\debug\deps\post_step_fixture-1d18b8dbc96bea00.exe)
2026-07-29T09:52:48.0358928Z 
2026-07-29T09:52:48.0359395Z running 0 tests
2026-07-29T09:52:48.0359612Z 
2026-07-29T09:52:48.0359950Z test result: ok. 0 passed; 0 failed; 0 ignored; 0 measured; 0 filtered out; finished in 0.00s
2026-07-29T09:52:48.0360369Z 
2026-07-29T09:52:48.0370815Z      Running unittests src\main.rs (target\debug\deps\spt-00956f2f38eb4ff4.exe)
2026-07-29T09:52:48.9532636Z 
2026-07-29T09:52:48.9533107Z running 457 tests
2026-07-29T09:52:48.9543500Z test api::auth::tests::mints_distinct_nonempty_tokens ... ok
2026-07-29T09:52:49.0113461Z test api::auth::tests::dead_owner_repin_refused_when_sid_is_a_psyche_custody_sid ... ok
2026-07-29T09:52:49.0319396Z test api::auth::tests::dead_owner_repin_refused_when_sid_owns_another_perch ... ok
2026-07-29T09:52:49.0698303Z test api::auth::tests::dead_owner_repin_still_rescues_a_non_custody_sid ... ok
2026-07-29T09:52:49.0818564Z test api::auth::tests::session_id_proof_authenticates ... ok
2026-07-29T09:52:49.0973653Z test api::auth::tests::missing_endpoint_is_no_endpoint ... ok
2026-07-29T09:52:49.0977496Z test api::auth::tests::token_proof_authenticates ... ok
2026-07-29T09:52:49.0986507Z test api::delivery::tests::inject_resolution_drops_pty_defaults_hook ... ok
2026-07-29T09:52:49.0987034Z test api::delivery::tests::inject_all_pty_falls_back_to_hook ... ok
2026-07-29T09:52:49.1137968Z test api::auth::tests::no_proof_is_refused ... ok
2026-07-29T09:52:49.7601212Z test api::auth::tests::pinned_to_dead_sid_mismatched_poll_repins ... ok
2026-07-29T09:52:49.7910460Z test api::auth::tests::live_owner_mismatch_still_refuses ... ok
2026-07-29T09:52:49.8054937Z test api::auth::tests::worker_missing_is_no_endpoint ... ok
2026-07-29T09:52:49.8057148Z test api::auth::tests::token_auth_path_unchanged ... ok
2026-07-29T09:52:49.8272777Z test api::auth::tests::worker_parent_current_sid_authenticates_after_rotation ... ok
2026-07-29T09:52:49.8480012Z test api::auth::tests::worker_stored_sid_authenticates ... ok
2026-07-29T09:52:49.8644260Z test api::auth::tests::worker_wrong_sid_and_token_only_refused ... ok
2026-07-29T09:52:49.8789400Z test api::auth::tests::wrong_token_and_wrong_session_refused ... ok
2026-07-29T09:52:49.9130224Z test api::delivery::tests::an_undated_state_is_dated_by_a_non_edge_report ... ok
2026-07-29T09:52:49.9175302Z test api::delivery::tests::echo_gate_explicit_toggle ... ok
2026-07-29T09:52:49.9329243Z test api::delivery::tests::idle_busy_transitions_manage_sentinels ... ok
2026-07-29T09:52:49.9332555Z test api::reporting::tests::capability_lists_hostable_types ... ok
2026-07-29T09:52:50.0515366Z test api::delivery::tests::idle_drain_peek_returns_non_deferred_rows_only ... ok
2026-07-29T09:52:50.0606314Z test api::delivery::tests::idle_no_gate_does_not_arm_gate ... ok
2026-07-29T09:52:50.1411730Z test api::delivery::tests::only_a_real_state_edge_stamps_the_transition_instant ... ok
2026-07-29T09:52:50.1413169Z test api::reporting::tests::endpoint_info_attached_node_from_honest_stamps ... ok
2026-07-29T09:52:50.1414334Z test api::reporting::tests::endpoint_info_attached_node_self_attributes_own_node_driver ... ok
2026-07-29T09:52:50.1416521Z test api::reporting::tests::endpoint_info_json_always_carries_an_activity_word ... ok
2026-07-29T09:52:50.3659158Z test api::delivery::tests::poll_drain_holds_deferred_while_resting_and_releases_once_on_wake ... ok
2026-07-29T09:52:50.3663335Z test api::reporting::tests::env_aliases_resolved_from_manifest ... ok
2026-07-29T09:52:50.5379206Z test api::delivery::tests::poll_drain_suppresses_idle_only_which_reaches_the_relay ... ok
2026-07-29T09:52:50.5382037Z test api::reporting::tests::filedrops_are_fixed_named_files ... ok
2026-07-29T09:52:50.7310768Z test api::delivery::tests::poll_drain_validates_notify_copies_against_their_rows ... ok
2026-07-29T09:52:50.8529020Z test api::delivery::tests::poll_drains_non_deferred_by_default ... ok
2026-07-29T09:52:50.9630883Z test api::delivery::tests::poll_only_drains_when_hook_method_present ... ok
2026-07-29T09:52:51.0846967Z test api::reporting::tests::boundary_appends_to_the_session_ledger ... ok
2026-07-29T09:52:51.2875528Z test api::reporting::tests::boundary_missing_perch_refused ... ok
2026-07-29T09:52:51.2933603Z test api::reporting::tests::boundary_injects_deferred_shell_context ... ok
2026-07-29T09:52:51.3723507Z test api::reporting::tests::boundary_rebinds_keeping_anchor ... ok
2026-07-29T09:52:51.3933987Z test api::reporting::tests::boundary_refuses_rotating_onto_a_psyche_custody_sid ... ok
2026-07-29T09:52:51.5936731Z test api::reporting::tests::boundary_resurfaces_undismissed_notifs ... ok
2026-07-29T09:52:51.6023227Z test api::startup::tests::a_dead_binder_pid_proves_nothing_and_never_drops_the_stamp ... ok
2026-07-29T09:52:51.6024227Z test api::startup::tests::a_dead_relays_capability_stamp_is_not_resurrected_by_a_listener_rebind ... ok
2026-07-29T09:52:51.7468320Z test api::reporting::tests::boundary_with_a_fresh_sid_is_unaffected_by_the_squat_guard ... ok
2026-07-29T09:52:51.7616838Z test api::reporting::tests::digest_entry_validates_and_appends_to_digest_log ... ok
2026-07-29T09:52:51.7834975Z test api::reporting::tests::driven_by_reads_daemon_marker ... ok
2026-07-29T09:52:51.8108125Z test api::reporting::tests::endpoint_info_activity_word_tracks_the_idle_sentinel ... ok
2026-07-29T09:52:51.8299163Z test api::reporting::tests::endpoint_info_reports_and_refuses ... ok
2026-07-29T09:52:51.8868001Z test api::reporting::tests::erase_unregisters_regardless_of_liveness ... ok
2026-07-29T09:52:51.9005656Z test api::reporting::tests::hint_once_per_session_one_per_message ... ok
2026-07-29T09:52:51.9198293Z test api::reporting::tests::history_log_appends ... ok
2026-07-29T09:52:51.9248087Z test api::reporting::tests::presence_records_endpoint ... ok
2026-07-29T09:52:52.0452703Z test api::reporting::tests::session_end_erase_reaps_stale_worker_then_proceeds ... ok
2026-07-29T09:52:52.1255966Z test api::reporting::tests::session_end_erase_refused_with_live_children ... ok
2026-07-29T09:52:52.1596992Z test api::reporting::tests::session_end_erase_wipes_childless_perch ... ok
2026-07-29T09:52:52.1598548Z test api::startup::tests::fresh_bind_over_dead_life_needs_both_terminal_and_a_new_session ... ok
2026-07-29T09:52:52.1995420Z test api::reporting::tests::session_end_soft_preserves_state ... ok
2026-07-29T09:52:52.2462331Z test api::reporting::tests::soft_end_preserves_a_live_listeners_address ... ok
2026-07-29T09:52:52.2463258Z test api::startup::tests::listen_never_asserts_hosting_topology_and_bind_still_does ... ok
2026-07-29T09:52:52.2464600Z test api::startup::tests::listen_online_gate_refuses_capability_only_online ... ok
2026-07-29T09:52:52.2465931Z test api::startup::tests::listen_orphan_exit_line_names_self_and_parent ... ok
2026-07-29T09:52:52.3092381Z test api::reporting::tests::soft_end_still_cleans_a_dead_listeners_address ... ok
2026-07-29T09:52:52.5492996Z test api::startup::tests::a_listener_over_a_dead_pty_is_not_offlined_by_the_liveness_reconcile ... ok
2026-07-29T09:52:52.6410442Z test api::startup::tests::bind_assigns_home_and_revive_preserves_it ... ok
2026-07-29T09:52:52.6633853Z test api::startup::tests::parent_watchdog_triggers_exit_on_a_dead_parent_only ... ok
2026-07-29T09:52:52.7046075Z test api::startup::tests::bind_gateway_earns_no_online_stamp ... ok
2026-07-29T09:52:53.1729968Z test api::startup::tests::bind_listen_control_detach_keeps_the_earned_hosting_authority ... ok
2026-07-29T09:52:53.1730606Z test api::startup::tests::read_env_measured_capture_replaces_prior_stamp ... ok
2026-07-29T09:52:53.2574990Z test api::startup::tests::bind_live_agent_over_prior_ready_agent_earns_online_on_controllable_with_preserved_type ... ok
2026-07-29T09:52:53.3608119Z test api::startup::tests::bind_records_cwd_so_picker_can_group_by_project ... ok
2026-07-29T09:52:53.3653576Z test api::startup::tests::bind_refuses_a_session_id_that_squats_a_psyche_custody_sid ... ok
2026-07-29T09:52:53.4557752Z test api::startup::tests::bind_with_type_establishes_a_gateway_endpoint ... ok
2026-07-29T09:52:53.4559085Z test api::startup::tests::seed_fail_eof_gives_actionable_stale_broker_hint ... ok
2026-07-29T09:52:53.4560395Z test api::startup::tests::seed_restorable_spends_dead_seeds_restores_recoverable ... ok
2026-07-29T09:52:53.4740884Z test api::startup::tests::bind_with_unrelated_sid_is_unaffected_by_the_squat_guard ... ok
2026-07-29T09:52:53.4786739Z test api::startup::tests::empty_session_seed_refusal_spends_the_seed_no_restore ... ok
2026-07-29T09:52:53.4850447Z test api::startup::tests::empty_session_seed_refused ... ok
2026-07-29T09:52:53.6055055Z test api::startup::tests::establish_stamps_controllable_by_hosting_mode ... ok
2026-07-29T09:52:53.7165887Z test api::startup::tests::fresh_create_over_a_stopped_life_reads_active_with_no_wake ... ok
2026-07-29T09:52:53.7939412Z test api::startup::tests::fresh_create_with_no_prior_carries_no_rest_state ... ok
2026-07-29T09:52:53.7940090Z test api::startup::tests::the_pid_role_is_stamped_from_the_entry_path ... ok
2026-07-29T09:52:53.8146126Z test api::startup::tests::live_perch_under_other_session_conflicts ... ok
2026-07-29T09:52:53.8162201Z test api::tests::adapter_is_optional ... ok
2026-07-29T09:52:53.8189734Z test api::startup::tests::missing_seed_refused ... ok
2026-07-29T09:52:53.8410566Z test api::startup::tests::no_seed_is_the_fallback_trigger_then_sid_binds ... ok
2026-07-29T09:52:53.9109734Z test api::startup::tests::post_spawn_bind_establishes_perch ... ok
2026-07-29T09:52:53.9354711Z test api::startup::tests::prebind_refusal_restores_the_seed_for_retry ... ok
2026-07-29T09:52:53.9364748Z test api::tests::state_value_is_validated ... ok
2026-07-29T09:52:53.9435573Z test api::tests::surface_parses ... ok
2026-07-29T09:52:54.0264712Z test api::startup::tests::rebind_same_session_ok ... ok
2026-07-29T09:52:54.1300870Z test api::startup::tests::revive_preserves_prior_rest_state_and_dormant_anchor ... ok
2026-07-29T09:52:54.2194135Z test api::startup::tests::revive_without_cwd_preserves_prior_cwd ... ok
2026-07-29T09:52:54.2457002Z test api::startup::tests::seed_bind_records_seed_captured_cwd ... ok
2026-07-29T09:52:54.2574887Z test api::startup::tests::session_id_fallback_binds_live_perch_from_sid ... ok
2026-07-29T09:52:54.2714015Z test api::startup::tests::session_id_fallback_refuses_empty_sid_and_dead_anchor ... ok
2026-07-29T09:52:54.2718904Z test api::startup::tests::session_id_fallback_refuses_a_psyche_custody_sid ... ok
2026-07-29T09:52:54.2731031Z test cli::resume_resolution_tests::resume_never_feeds_a_provisional ... ok
2026-07-29T09:52:54.2732557Z test cli::run_home_tests::order_by_mru_orders_guidance ... ok
2026-07-29T09:52:54.2734275Z test cli::run_home_tests::run_home_resolution_matrix ... ok
2026-07-29T09:52:54.2735798Z test cli::run_on_live_tests::run_on_live_never_duplicates_and_create_conflicts ... ok
2026-07-29T09:52:54.2737465Z test cli::run_target_tests::resolve_run_target_quadrants ... ok
2026-07-29T09:52:54.2780190Z test api::startup::tests::stale_seed_refusal_spends_the_seed_no_restore ... ok
2026-07-29T09:52:54.2782194Z test cli::tests::a_status_row_reads_held_over_running_and_carries_its_evidence ... ok
2026-07-29T09:52:54.2833197Z test cli::tests::access_subcommands_parse ... ok
2026-07-29T09:52:54.2853339Z test api::startup::tests::stale_seed_with_dead_anchor_refused ... ok
2026-07-29T09:52:54.2879324Z test cli::tests::adapter_add_transport_flags_parse ... ok
2026-07-29T09:52:54.3123203Z test api::startup::tests::successful_bind_consumes_the_seed_exactly_once ... ok
2026-07-29T09:52:54.3229501Z test cli::tests::a_local_hit_never_asks_the_broker ... ok
2026-07-29T09:52:54.3338013Z test api::startup::tests::valid_seed_binds_live_perch ... ok
2026-07-29T09:52:54.3340018Z test cli::tests::adapter_name_validation_flags_every_unknown ... ok
2026-07-29T09:52:54.3342135Z test cli::tests::adapter_names_comma_list_parses_and_refuses_empties ... ok
2026-07-29T09:52:54.3346324Z test api::tests::ctx_manifest_override_wins_when_manifest_present ... ok
2026-07-29T09:52:54.3453670Z test api::tests::ctx_manifest_unregistered_no_manifest_is_none_not_fatal ... ok
2026-07-29T09:52:54.3459938Z test api::tests::ctx_manifest_resolves_from_registry_when_manifest_absent ... ok
2026-07-29T09:52:54.3464298Z test cli::tests::adapter_translate_proof_gates_on_commit ... FAILED
2026-07-29T09:52:54.3501547Z test api::tests::load_manifest_resolves_composite_adapter_option ... ok
2026-07-29T09:52:54.3506582Z test cli::tests::adapter_update_install_dir_is_registered_source_dir_not_repo_name ... ok
2026-07-29T09:52:54.3511611Z test cli::tests::adapter_update_notice_absent_when_no_message ... ok
2026-07-29T09:52:54.3516758Z test cli::tests::adapter_update_notice_renders_declared_message_markdown ... ok
2026-07-29T09:52:54.3518881Z test cli::tests::adapter_update_summary_and_exit_aggregate_isolated_failures ... ok
2026-07-29T09:52:54.3519311Z test cli::tests::adapter_translate_proof_parses ... ok
2026-07-29T09:52:54.3536946Z test cli::tests::adapter_version_parses ... ok
2026-07-29T09:52:54.3595314Z test cli::tests::adapter_subcommands_parse ... ok
2026-07-29T09:52:54.3597937Z test cli::tests::all_hidden_this_node_suppresses_no_perches_marker ... ok
2026-07-29T09:52:54.3599998Z test cli::tests::already_applied_message_reads_up_to_date_no_restart ... ok
2026-07-29T09:52:54.3602498Z test cli::tests::any_single_evidence_source_is_enough_and_only_nothing_refuses ... ok
2026-07-29T09:52:54.3627188Z test cli::tests::api_adapter_flag_is_group_level_not_post_subcommand ... ok
2026-07-29T09:52:54.3652485Z test cli::tests::api_listen_accepts_session_id_flag ... ok
2026-07-29T09:52:54.3654572Z test cli::tests::applied_message_appends_restart_required_notice ... ok
2026-07-29T09:52:54.3656606Z test cli::tests::applied_message_renders_semver_or_counter_fallback_and_states_applied ... ok
2026-07-29T09:52:54.3884104Z test api::worker::tests::cascade_guard_tracks_live_children ... ok
2026-07-29T09:52:54.4849257Z test api::worker::tests::guard_clears_only_when_all_children_stopped ... ok
2026-07-29T09:52:54.4880481Z test cli::tests::bare_spt_parses_to_none ... ok
2026-07-29T09:52:54.4883165Z test cli::tests::bare_tty_guard ... ok
2026-07-29T09:52:54.4925612Z test cli::tests::bare_update_parses_composite_flags ... ok
2026-07-29T09:52:54.4927710Z test cli::tests::broker_image_line_reports_without_warning_or_remedy ... ok
2026-07-29T09:52:54.4929122Z test cli::tests::classify_fetch_reject_matrix ... ok
2026-07-29T09:52:54.4930578Z test cli::tests::classify_flat_archive_never_misfires ... ok
2026-07-29T09:52:54.4931948Z test cli::tests::classify_multiplatform_captures_only_known_triples ... ok
2026-07-29T09:52:54.4933343Z test cli::tests::cli_send_stamps_cli_at_node_origin ... ok
2026-07-29T09:52:54.4934795Z test cli::tests::composite_plans_core_first_and_core_only_skips_adapters ... ok
2026-07-29T09:52:54.4936297Z test cli::tests::connection_lines_net_less_hides_stale_heartbeat ... ok
2026-07-29T09:52:54.4938148Z test cli::tests::coordinator_image_line_is_the_only_stale_warning ... ok
2026-07-29T09:52:54.4941164Z test cli::tests::create_existing_name_is_usage_error ... ok
2026-07-29T09:52:54.4943879Z test cli::tests::create_new_existing_name_is_usage_error ... ok
2026-07-29T09:52:54.5108327Z test cli::tests::create_new_mints_shows_and_requests_save ... ok
2026-07-29T09:52:54.5111260Z test cli::tests::create_not_elevated_refuses_without_saving ... ok
2026-07-29T09:52:54.5176828Z test cli::tests::apply_release_crc_swap_only_swaps_changed ... ok
2026-07-29T09:52:54.5179250Z test cli::tests::cross_node_after_filters_a_sealed_turn_exactly_like_the_local_path ... ok
2026-07-29T09:52:54.5181615Z test cli::tests::daemon_offline_hint_only_when_down ... ok
2026-07-29T09:52:54.5226130Z test cli::tests::daemon_refresh_verb_parses ... ok
2026-07-29T09:52:54.5279512Z test cli::tests::create_prints_joining_material_when_elevated ... ok
2026-07-29T09:52:54.5281991Z test cli::tests::daemonless_apply_message_points_at_finish_or_start ... ok
2026-07-29T09:52:54.5287160Z test cli::tests::deferred_elevation_gate_matrix ... ok
2026-07-29T09:52:54.5304724Z test cli::tests::digest_cursor_flags_parse ... ok
2026-07-29T09:52:54.5323360Z test cli::tests::digest_flag_defaults ... ok
2026-07-29T09:52:54.5325666Z test cli::tests::digest_human_path_keeps_the_stderr_trailer ... ok
2026-07-29T09:52:54.5328706Z test cli::tests::digest_json_carries_version_and_leaves_stderr_clean ... ok
2026-07-29T09:52:54.5330909Z test cli::tests::digest_json_predates_path_still_carries_version ... ok
2026-07-29T09:52:54.5332160Z test cli::tests::empty_store_no_flag_guides_to_pair_or_create ... ok
2026-07-29T09:52:54.5339048Z test cli::tests::daemon_subcommands_parse ... ok
2026-07-29T09:52:54.5370245Z test cli::tests::endpoint_role_parses ... ok
2026-07-29T09:52:54.5372157Z test cli::tests::endpoint_row_json_endpoint_type_is_additive ... ok
2026-07-29T09:52:54.6690889Z test api::worker::tests::worker_poll_drains_spool ... ok
2026-07-29T09:52:54.6818139Z test cli::tests::endpoint_subcommands_parse ... ok
2026-07-29T09:52:54.6819440Z test cli::tests::escalation_choice_parses_fail_closed ... ok
2026-07-29T09:52:54.6919194Z test cli::tests::every_read_status_command_emits_valid_json ... ok
2026-07-29T09:52:54.8472374Z test cli::tests::extract_legacy_flat_stays_flat ... ok
2026-07-29T09:52:54.9403896Z test cli::tests::extract_multiplatform_missing_my_triple_is_typed_rejection ... ok
2026-07-29T09:52:54.9800779Z test api::worker::tests::worker_poll_holds_deferred_while_resting ... ok
2026-07-29T09:52:54.9801571Z test cli::tests::fetch_reject_action_apply_decision ... ok
2026-07-29T09:52:54.9802864Z test cli::tests::filter_after_excludes_at_or_below_cursor ... ok
2026-07-29T09:52:54.9804541Z test cli::tests::filter_after_predates_window_returns_full ... ok
2026-07-29T09:52:54.9805746Z test cli::tests::finish_message_states_fully_live_no_manual_restart ... ok
2026-07-29T09:52:55.0062728Z test cli::tests::extract_multiplatform_places_shared_root_and_flattens_my_triple ... ok
2026-07-29T09:52:55.0064022Z test cli::tests::gh_download_command_no_tag_omits_tag ... ok
2026-07-29T09:52:55.0065648Z test cli::tests::gh_download_command_with_tag_shape ... ok
2026-07-29T09:52:55.0066943Z test cli::tests::gh_failure_classes_render_os_correct_hints ... ok
2026-07-29T09:52:55.0068616Z test cli::tests::gh_release_version_compare_decision ... ok
2026-07-29T09:52:55.0069862Z test cli::tests::gh_version_command_shape ... ok
2026-07-29T09:52:55.0118916Z test cli::tests::grant_subcommands_parse ... ok
2026-07-29T09:52:55.0168061Z test cli::tests::help_groups_cover_every_command ... ok
2026-07-29T09:52:55.0270048Z test cli::tests::hot_path_flat_and_moved_verbs_gone ... ok
2026-07-29T09:52:55.0296862Z test api::worker::tests::worker_start_mints_id_stores_parent_sid_and_metadata ... ok
2026-07-29T09:52:55.0311479Z test cli::tests::how_to_topics_cover_ready_and_send ... ok
2026-07-29T09:52:55.0313032Z test cli::tests::install_platform_check_gates_stamp_and_host_arch ... ok
2026-07-29T09:52:55.0315655Z test cli::tests::instance_rows_palette_and_align ... ok
2026-07-29T09:52:55.0318979Z test cli::tests::instance_rows_project_column ... ok
2026-07-29T09:52:55.0342940Z test cli::tests::invalid_usage_errors ... ok
2026-07-29T09:52:55.0344227Z test cli::tests::join_gate_refuses_without_confirmed_elevation ... ok
2026-07-29T09:52:55.0346486Z test cli::tests::json_activity_key_is_local_only_and_skips_when_unknown ... ok
2026-07-29T09:52:55.0358117Z test cli::tests::json_activity_words_come_from_the_shared_vocabulary_source ... ok
2026-07-29T09:52:55.0386293Z test cli::tests::install_place_is_idempotent_and_path_block_detected ... ok
2026-07-29T09:52:55.0387700Z test cli::tests::json_project_field_skip_if_none ... ok
2026-07-29T09:52:55.0513248Z test cli::tests::multi_subnet_refuses_without_flag_then_resolves_with_it ... ok
2026-07-29T09:52:55.0515384Z test cli::tests::node_group_discards_self_and_skips_empty ... ok
2026-07-29T09:52:55.0517192Z test cli::tests::node_group_freshest_epoch_wins_and_unions_subnets ... ok
2026-07-29T09:52:55.0519135Z test cli::tests::node_group_same_id_two_nodes_two_groups ... ok
2026-07-29T09:52:55.0521270Z test cli::tests::node_grouped_render_structure_and_palette ... ok
2026-07-29T09:52:55.0524437Z test cli::tests::node_level_label_names_an_endpointless_peer ... ok
2026-07-29T09:52:55.0525757Z test api::worker::tests::worker_start_nests_under_parent ... ok
2026-07-29T09:52:55.0527035Z test cli::tests::node_rows_disambiguate_only_on_label_collision ... ok
2026-07-29T09:52:55.0528323Z test cli::tests::node_status_rows_denominator_counts_routable_only ... ok
2026-07-29T09:52:55.0529337Z test cli::tests::node_status_rows_settle_cheap_signals_probe_only_stale ... ok
2026-07-29T09:52:55.0531148Z test cli::tests::not_elevated_refuses_without_leaking_code_or_saving ... ok
2026-07-29T09:52:55.0533535Z test cli::tests::notify_subnet_resolution_home_default ... ok
2026-07-29T09:52:55.0534782Z test cli::tests::origin_asset_urls_latest_and_tag ... ok
2026-07-29T09:52:55.0588223Z test cli::tests::notify_surface_parses ... ok
2026-07-29T09:52:55.0605625Z test cli::tests::pair_namespace_is_gone ... ok
2026-07-29T09:52:55.0608732Z test cli::tests::peer_health_line_names_the_stage_and_stays_silent_when_idle ... ok
2026-07-29T09:52:55.0609985Z test cli::tests::poll_until_ready_fastpath_timeout_and_later_success ... ok
2026-07-29T09:52:55.0611471Z test cli::tests::post_step_notice_arbitration ... ok
2026-07-29T09:52:55.0773662Z test api::worker::tests::worker_start_registration_sid_falls_back_to_presented ... ok
2026-07-29T09:52:55.1962688Z test cli::tests::adapter_digest_proof_fills_session_id_key ... ok
2026-07-29T09:52:55.2785436Z test cli::tests::probe_all_runs_concurrently_in_input_order ... ok
2026-07-29T09:52:55.2786378Z test cli::tests::project_index_line_states_health_not_presence ... ok
2026-07-29T09:52:55.2788017Z test cli::tests::prune_candidates_resolve_never_guess ... ok
2026-07-29T09:52:55.3340282Z test cli::tests::adapter_digest_proof_gates_on_drops ... ok
2026-07-29T09:52:55.3567318Z test cli::tests::probe_all_timeout_settles_false_without_stalling_batch ... ok
2026-07-29T09:52:55.3573515Z test cli::tests::adapter_has_live_endpoint_detects_matching_live_perch ... ok
2026-07-29T09:52:55.3783739Z test cli::tests::registered_github_home_detects_active_collision ... ok
2026-07-29T09:52:55.4103081Z test cli::tests::adapter_has_live_endpoint_false_for_other_or_dead ... ok
2026-07-29T09:52:55.4104390Z test cli::tests::remote_cell_project_ref_from_gossiped_recent_projects ... ok
2026-07-29T09:52:55.4413436Z test cli::tests::adapter_profile_verbs_local_only ... ok
2026-07-29T09:52:55.4414193Z test cli::tests::resolve_transport_auto_follows_probe ... ok
2026-07-29T09:52:55.4463298Z test cli::tests::resolve_transport_explicit_never_probes ... ok
2026-07-29T09:52:55.4464559Z test cli::tests::rest_filter_hides_suspended_shows_all_and_corrupt_always ... ok
2026-07-29T09:52:55.4471346Z test cli::tests::rest_filter_status_first_ordering ... ok
2026-07-29T09:52:55.4474930Z test cli::tests::rest_filter_total_disclosure_and_corrupt_annotation ... ok
2026-07-29T09:52:55.4478191Z test cli::tests::restart_plans_lethal_leg_last ... ok
2026-07-29T09:52:55.4522719Z test cli::tests::ring_timeout_defaults ... ok
2026-07-29T09:52:55.4748717Z test cli::tests::adapter_string_verbs ... ok
2026-07-29T09:52:55.4750264Z test cli::tests::self_pin_annotates_psyche_host_failure ... ok
2026-07-29T09:52:55.4751492Z test cli::tests::self_pin_annotates_translation_fault ... ok
2026-07-29T09:52:55.4753102Z test cli::tests::self_pin_includes_description_when_present ... ok
2026-07-29T09:52:55.4788818Z test cli::tests::send_reply_to_flag_is_removed_and_target_required ... ok
2026-07-29T09:52:55.4818016Z test cli::tests::send_user_msg_flag_parses ... ok
2026-07-29T09:52:55.5008311Z test cli::tests::adapter_use_sets_and_clears_pointer ... ok
2026-07-29T09:52:55.5111180Z test cli::tests::run_bounded_yields_value_or_timeout_default ... ok
2026-07-29T09:52:55.5206370Z test cli::tests::adapter_version_surfaces_declared_adapter_version ... ok
2026-07-29T09:52:55.5461636Z test cli::tests::release_archive_extracts_to_a_registrable_root ... ok
2026-07-29T09:52:55.5520889Z test cli::tests::apply_user_msg_gate_local_origination ... ok
2026-07-29T09:52:55.5704426Z test cli::tests::probe_all_cap_batches_into_windows ... ok
2026-07-29T09:52:56.5800491Z test cli::tests::endpoint_role_overwrite_is_the_sole_writer ... ok
2026-07-29T09:52:56.5892032Z test cli::tests::shell_subcommands_parse ... ok
2026-07-29T09:52:56.6004503Z test cli::tests::show_code_prints_reprovisioning_material ... ok
2026-07-29T09:52:56.6742616Z test cli::tests::endpoint_stop_marks_offline ... ok
2026-07-29T09:53:02.1443901Z test cli::tests::json_payload_rides_as_attr_alongside_body ... ok
2026-07-29T09:53:02.1719218Z test cli::tests::fork_forks_homes_and_deletes_exactly_the_source ... ok
2026-07-29T09:53:02.1821661Z test cli::tests::single_subnet_auto_selects_and_code_matches_seed ... ok
2026-07-29T09:53:18.7969479Z test cli::tests::owner_shutdown_gated_by_can_shutdown_grant ... ok
2026-07-29T09:53:18.8901228Z test cli::tests::stage_then_swap_failed_fetch_preserves_install ... ok
2026-07-29T09:53:19.4083763Z test cli::tests::staged_floor_admits_when_core_meets_floor ... ok
2026-07-29T09:53:19.4631834Z test cli::tests::staged_floor_refuses_above_floor_and_leaves_dest_untouched ... ok
2026-07-29T09:53:19.4632743Z test cli::tests::stall_evict_line_surfaces_only_a_real_tally ... ok
2026-07-29T09:53:19.4634043Z test cli::tests::stop_guard_refuses_live_sessions_without_force ... ok
2026-07-29T09:53:19.4741283Z test cli::tests::subcommands_parse ... ok
2026-07-29T09:53:19.4888514Z test cli::tests::subnet_arg_shapes_parse ... ok
2026-07-29T09:53:19.4892781Z test cli::tests::subnet_status_renders_rows_and_hints_never_secrets ... ok
2026-07-29T09:53:19.4894129Z test cli::tests::subnets_joined_banner_renders_rows_and_divider ... ok
2026-07-29T09:53:19.4895487Z test cli::tests::subprocess_detail_prefers_stderr_then_stdout ... ok
2026-07-29T09:53:19.5208877Z test cli::tests::purge_force_asks_before_it_tears_anything_down ... ok
2026-07-29T09:53:19.5210906Z test cli::tests::this_node_group_merges_roster_with_unbound_truth ... ok
2026-07-29T09:53:19.5212150Z test cli::tests::trust_mutation_gate_refuses_without_confirmed_elevation ... ok
2026-07-29T09:53:19.5214854Z test cli::tests::unknown_elevation_falls_back ... ok
2026-07-29T09:53:19.5217682Z test cli::tests::unknown_named_subnet_is_usage_error ... ok
2026-07-29T09:53:19.5235381Z test cli::tests::update_adapters_verb_parses_with_optional_names ... ok
2026-07-29T09:53:19.5252639Z test cli::tests::update_fetch_apply_flag_parses ... ok
2026-07-29T09:53:19.5269055Z test cli::tests::whoami_parses_as_the_identity_verb ... ok
2026-07-29T09:53:19.5270511Z test elevation::tests::already_elevated_short_circuits_on_every_os ... ok
2026-07-29T09:53:19.5271776Z test elevation::tests::current_returns_a_determinate_level_on_supported_platforms ... ok
2026-07-29T09:53:19.5273036Z test elevation::tests::fallback_message_names_authenticator_app_and_subnet ... ok
2026-07-29T09:53:19.5274074Z test elevation::tests::gate_shows_only_when_confirmed_elevated ... ok
2026-07-29T09:53:19.5275368Z test elevation::tests::launcher_argv_is_absolute_exe_plus_verbatim_args ... ok
2026-07-29T09:53:19.5276756Z test elevation::tests::launchers_never_shell_interpolate_a_crafted_arg ... ok
2026-07-29T09:53:19.5278402Z test elevation::tests::print_hint_floor_uses_absolute_path_each_os ... ok
2026-07-29T09:53:19.5279265Z test elevation::tests::unix_path_order_tty_then_pkexec_then_terminal_then_hint ... ok
2026-07-29T09:53:19.5280320Z test elevation::tests::windows_uac_only_interactive_other_always_prints ... ok
2026-07-29T09:53:19.5281537Z test helpfmt::tests::atx_header_at_line_start_strips_and_bolds ... ok
2026-07-29T09:53:19.5282706Z test helpfmt::tests::bold_styles_with_color_and_strips_without ... ok
2026-07-29T09:53:19.5284215Z test helpfmt::tests::code_styles_with_color_and_strips_without ... ok
2026-07-29T09:53:19.5285247Z test helpfmt::tests::color_enabled_truth_table ... ok
2026-07-29T09:53:19.5286504Z test helpfmt::tests::dual_contract_token_survives_strip_mode ... ok
2026-07-29T09:53:19.5287586Z test helpfmt::tests::dual_contract_token_unstyled_while_prose_styles_on_color ... ok
2026-07-29T09:53:19.5288589Z test helpfmt::tests::empty_and_unmatched_markers_stay_literal ... ok
2026-07-29T09:53:19.5289604Z test helpfmt::tests::link_becomes_its_text ... ok
2026-07-29T09:53:19.5290684Z test helpfmt::tests::marker_never_spans_a_hard_break ... ok
2026-07-29T09:53:19.5291745Z test helpfmt::tests::marker_spans_a_clap_soft_wrap ... ok
2026-07-29T09:53:19.5292724Z test helpfmt::tests::multibyte_text_survives ... ok
2026-07-29T09:53:19.5293781Z test helpfmt::tests::nested_code_inside_bold_styles_both ... ok
2026-07-29T09:53:19.5294788Z test helpfmt::tests::plain_text_is_unchanged ... ok
2026-07-29T09:53:19.5295866Z test helpfmt::tests::preexisting_ansi_is_passed_through_untouched ... ok
2026-07-29T09:53:19.5296683Z test helpfmt::tests::resolve_console_color_strips_when_vt_unavailable ... ok
2026-07-29T09:53:19.5298194Z test picker::data::tests::disambiguate_project_ids_cases ... ok
2026-07-29T09:53:19.5299480Z test picker::data::tests::driven_by_display_renders_name_not_hex ... ok
2026-07-29T09:53:19.5458667Z test cli::tests::purge_offline_gate_and_self_guard ... ok
2026-07-29T09:53:19.5680425Z test cli::tests::the_evidence_census_reads_each_local_source ... ok
2026-07-29T09:53:22.0722858Z test cli::tests::resolve_proof_target_override_reads_on_disk ... ok
2026-07-29T09:53:22.0724913Z test picker::data::tests::indexed_projection_full_w2shaped_and_absent_legs ... ok
2026-07-29T09:53:22.0726069Z test picker::data::tests::non_drivable_predicate_covers_worker_and_psyche ... ok
2026-07-29T09:53:22.0762053Z test cli::tests::purge_removes_every_record ... ok
2026-07-29T09:53:22.8343064Z test cli::tests::shell_channels_relay_sensory_and_text_file ... ok
2026-07-29T09:53:22.8344664Z test picker::data::tests::project_refs_from_sessions_excludes_owlery_and_dedups_newest_first ... ok
2026-07-29T09:53:22.8346278Z test picker::data::tests::project_refs_from_unions_fresh_origin_and_store_branches ... ok
2026-07-29T09:53:22.8347866Z test picker::data::tests::reconcile_overrides_subnet_with_local_roster ... ok
2026-07-29T09:53:22.8698753Z test cli::tests::shell_owner_exclusivity_negatives ... ok
2026-07-29T09:53:22.9634185Z test cli::tests::shell_relink_relaunches_offline_instances_only ... ok
2026-07-29T09:53:22.9635787Z test picker::data::tests::resume_rows_derive_per_row_project_and_drop_owlery_sessions ... ok
2026-07-29T09:53:23.1314419Z test cli::tests::shell_spawn_approval_floor_gates ... ok
2026-07-29T09:53:23.1315265Z test picker::data::tests::row_status_drives_unbound_display ... ok
2026-07-29T09:53:23.4172208Z test cli::tests::shell_spawn_cap_and_over_cap_gates ... ok
2026-07-29T09:53:23.4173394Z test picker::model::tests::adapter_tree_nests_profiles ... ok
2026-07-29T09:53:23.4174697Z test picker::model::tests::back_unwinds ... ok
2026-07-29T09:53:23.4176374Z test picker::model::tests::build_project_choices_head_here_rest ... ok
2026-07-29T09:53:23.4178093Z test picker::model::tests::category_labels_render_display_forms ... ok
2026-07-29T09:53:23.4179322Z test picker::model::tests::category_ring_wraps ... ok
2026-07-29T09:53:23.4181234Z test picker::model::tests::change_adapter_picks_and_returns_to_confirm ... ok
2026-07-29T09:53:23.4183018Z test picker::model::tests::choose_project_outcome_bakes_cwd_and_diverts ... ok
2026-07-29T09:53:23.4184188Z test picker::model::tests::confirm_local_offline_unchanged_by_wake_split ... ok
2026-07-29T09:53:23.4185645Z test picker::model::tests::confirm_options_remote_suspended_is_wake_not_start ... ok
2026-07-29T09:53:23.4186907Z test picker::model::tests::confirm_options_status_dependent ... ok
2026-07-29T09:53:23.4188368Z test picker::model::tests::confirm_terminal_routes ... ok
2026-07-29T09:53:23.4189626Z test picker::model::tests::confirm_terminal_wake_carries_raw_node ... ok
2026-07-29T09:53:23.4190917Z test picker::model::tests::create_new_multisubnet_inserts_home_layer ... ok
2026-07-29T09:53:23.4192094Z test picker::model::tests::create_outcome_bakes_run ... ok
2026-07-29T09:53:23.4193054Z test picker::model::tests::cursor_clamps ... ok
2026-07-29T09:53:23.4194223Z test picker::model::tests::display_mapping_matrix ... ok
2026-07-29T09:53:23.4195590Z test picker::model::tests::display_status_four_state_type_gated ... ok
2026-07-29T09:53:23.4196694Z test picker::model::tests::display_status_unbound_is_hollow_and_attachable ... ok
2026-07-29T09:53:23.4197982Z test picker::model::tests::empty_scope_opens_create ... ok
2026-07-29T09:53:23.4199306Z test picker::model::tests::ep_display_glyph_and_square_palette ... ok
2026-07-29T09:53:23.4200680Z test picker::model::tests::esc_backs_out_of_home_layer ... ok
2026-07-29T09:53:23.4203351Z test picker::model::tests::filter_narrows ... ok
2026-07-29T09:53:23.4204855Z test picker::model::tests::from_resource_row_maps_gossiped_adapter_projects_controlled ... ok
2026-07-29T09:53:23.4206182Z test picker::model::tests::home_selection_bakes_into_run_subnet ... ok
2026-07-29T09:53:23.4207197Z test picker::model::tests::kind_routes ... ok
2026-07-29T09:53:23.4208779Z test picker::model::tests::launch_keys_live_only_on_launch_capable_highlights ... ok
2026-07-29T09:53:23.4209903Z test picker::model::tests::prefill_jumps_to_create ... ok
2026-07-29T09:53:23.4211143Z test picker::model::tests::project_filter_keys_on_slug_while_tab_renders_display ... ok
2026-07-29T09:53:23.4212386Z test picker::model::tests::purge_confirm_yields_outcome_and_backs_out ... ok
2026-07-29T09:53:23.4213604Z test picker::model::tests::purge_shortcut_gates_to_offline_local ... ok
2026-07-29T09:53:23.4214839Z test picker::model::tests::reenter_create_keeps_or_clears_id ... ok
2026-07-29T09:53:23.4216197Z test picker::model::tests::remove_endpoint_drops_row_and_clamps_cursor ... ok
2026-07-29T09:53:23.4217456Z test picker::model::tests::resume_outcome_adapter_follows_recorded_row ... ok
2026-07-29T09:53:23.4218713Z test picker::model::tests::resume_outcome_bakes_session ... ok
2026-07-29T09:53:23.4221056Z test picker::model::tests::resume_title_render ... ok
2026-07-29T09:53:23.4222446Z test picker::model::tests::should_offer_project_choice_fire_conditions ... ok
2026-07-29T09:53:23.4223717Z test picker::model::tests::single_subnet_skips_home_layer ... ok
2026-07-29T09:53:23.4224840Z test picker::model::tests::suspended_is_distinct_from_offline ... ok
2026-07-29T09:53:23.4226112Z test picker::model::tests::visible_partitions_and_sorts ... ok
2026-07-29T09:53:23.4227885Z test picker::shortcut::tests::bakes_create_attach_by_default ... ok
2026-07-29T09:53:23.4229332Z test picker::shortcut::tests::bakes_resume_and_action ... ok
2026-07-29T09:53:23.4230777Z test picker::shortcut::tests::basename_is_parameterized ... ok
2026-07-29T09:53:23.4232434Z test picker::shortcut::tests::sentinel_detection ... ok
2026-07-29T09:53:23.4457436Z test picker::shortcut::tests::write_create_update_refuse ... ok
2026-07-29T09:53:23.4459144Z test picker::tests::backspace_backs_out_screens_like_esc ... ok
2026-07-29T09:53:23.4460621Z test picker::tests::backspace_stays_char_delete_in_text_contexts ... ok
2026-07-29T09:53:23.4461800Z test picker::tests::purge_outcomes_convert_to_flash_lines ... ok
2026-07-29T09:53:23.4518961Z test picker::tests::purge_transition_reconstructs_the_complete_screen_after_external_mutation ... ok
2026-07-29T09:53:23.4555138Z test picker::view::tests::adapter_tree_buffer ... ok
2026-07-29T09:53:23.4590322Z test picker::view::tests::change_adapter_screen_renders_tree_and_apply_legend ... ok
2026-07-29T09:53:23.4620532Z test picker::view::tests::choose_project_buffer_keeps_confirm_panel ... ok
2026-07-29T09:53:23.4665752Z test picker::view::tests::confirm_buffer_options ... ok
2026-07-29T09:53:23.4705177Z test picker::view::tests::confirm_fork_and_shortcut_labels_are_dir_relative ... ok
2026-07-29T09:53:23.4745605Z test picker::view::tests::confirm_panel_history_renders_display_not_slug ... ok
2026-07-29T09:53:23.4771371Z test picker::view::tests::create_home_lists_subnets ... ok
2026-07-29T09:53:23.4838272Z test picker::view::tests::footer_hints_h_s_only_when_launch_keys_live ... ok
2026-07-29T09:53:23.4862686Z test picker::view::tests::kind_buffer ... ok
2026-07-29T09:53:23.4909646Z test picker::view::tests::pick_buffer_has_squares_and_description ... ok
2026-07-29T09:53:23.4958046Z test picker::view::tests::pick_empty_category_hint ... ok
2026-07-29T09:53:23.5185718Z test picker::view::tests::pick_status_line_four_state ... ok
2026-07-29T09:53:23.5218441Z test picker::view::tests::resume_buffer_keeps_confirm_panel ... ok
2026-07-29T09:53:23.5258186Z test picker::view::tests::resume_buffer_lists_sessions ... ok
2026-07-29T09:53:34.5033092Z test cli::tests::shell_spawn_gates_on_the_registered_set ... ok
2026-07-29T09:53:34.5033942Z test rc::tests::attach_gate_routes_on_session_truth_not_the_row ... ok
2026-07-29T09:53:34.7096851Z test cli::tests::shell_spawn_profiled_option_resolves_and_shares_cap ... ok
2026-07-29T09:53:34.9017064Z test cli::tests::shutdown_and_stop_share_the_postcondition_and_differ_only_in_ceremony ... ok
2026-07-29T09:53:34.9018751Z test rc::tests::bracketed_paste_framing_is_exact_and_content_verbatim ... ok
2026-07-29T09:53:34.9021733Z test rc::tests::broker_host_child ... ok
2026-07-29T09:53:34.9023569Z test rc::tests::canonical_wire_id_strips_qualifiers_to_the_bare_id ... ok
2026-07-29T09:53:34.9024769Z test rc::tests::classify_read_err_eof_is_graceful_not_fatal ... ok
2026-07-29T09:53:34.9026565Z test rc::tests::clipboard_paste_wraps_nonempty_and_noops_on_empty_or_failure ... ok
2026-07-29T09:53:34.9028044Z test rc::tests::detach_keybind_semantics ... ok
2026-07-29T09:53:34.9029285Z test rc::tests::detach_prefix_spans_chunks ... ok
2026-07-29T09:53:34.9030770Z test rc::tests::display_guard_postlude_exactly_once_and_inactive_silent ... ok
2026-07-29T09:53:34.9032441Z test rc::tests::driver_phrase_names_own_node_plainly_but_remote_verbatim ... ok
2026-07-29T09:53:35.1690365Z test cli::tests::shutdown_on_a_broker_hosted_endpoint_stamps_after_the_reap ... ok
2026-07-29T09:53:35.1691011Z test rc::tests::first_event_stall_decision ... ok
2026-07-29T09:53:35.1691486Z test rc::tests::give_up_copy_names_daemon_down_vs_generic ... ok
2026-07-29T09:53:35.1692331Z test rc::tests::harness_only_row_matches_online_seatless_live_agents_only ... ok
2026-07-29T09:53:35.1692858Z test rc::tests::identity_line_format ... ok
2026-07-29T09:53:35.1694547Z test rc::tests::key_event_step_detach_sm ... ok
2026-07-29T09:53:35.1759432Z test rc::tests::mouse_is_paste_only_right_button_down ... ok
2026-07-29T09:53:35.1761110Z test rc::tests::mouse_mode_decset_scan_survives_split_across_chunks ... ok
2026-07-29T09:53:35.1761600Z test rc::tests::mouse_mode_decset_scan_tracks_enable_and_sgr ... ok
2026-07-29T09:53:35.1772147Z test rc::tests::op_minter_distinct_and_monotonic ... ok
2026-07-29T09:53:35.1777708Z test rc::tests::pre_broker_busy_guidance_fires_for_any_driver_not_just_remote ... ok
2026-07-29T09:53:35.1781289Z test rc::tests::public_attach_failure_maps_deadline_class_only ... ok
2026-07-29T09:53:35.1782950Z test rc::tests::pump_status_emit_sequence_over_write_sink ... ok
2026-07-29T09:53:35.2601240Z test cli::tests::shutdown_on_a_harness_hosted_endpoint_claims_no_process ... ok
2026-07-29T09:53:35.2601793Z test rc::tests::reassert_scanner_survives_split_across_chunks ... ok
2026-07-29T09:53:35.2602732Z test rc::tests::reassert_scanner_triggers_only_on_region_destroyers ... ok
2026-07-29T09:53:35.2604139Z test rc::tests::reconnect_banner_clears_and_centers ... ok
2026-07-29T09:53:35.2605371Z test rc::tests::reconnect_banner_shows_the_countdown ... ok
2026-07-29T09:53:35.2606615Z test rc::tests::reconnect_class_only_severed_transport_redrives ... ok
2026-07-29T09:53:35.2607915Z test rc::tests::reconnect_remaining_secs_counts_down_ceil ... ok
2026-07-29T09:53:35.2609168Z test rc::tests::reconnect_window_expiry_decision ... ok
2026-07-29T09:53:35.2610709Z test rc::tests::scroll_dir_classifies_wheel_only ... ok
2026-07-29T09:53:35.2611931Z test rc::tests::scroll_sgr_emits_exact_xterm_bytes ... ok
2026-07-29T09:53:35.2613111Z test rc::tests::serve_eof_severed_vs_refused ... ok
2026-07-29T09:53:35.2614548Z test rc::tests::status_assert_reserves_row1_then_repaints ... ok
2026-07-29T09:53:35.2615796Z test rc::tests::status_repaint_exact_bytes_and_right_align ... ok
2026-07-29T09:53:35.2617083Z test rc::tests::status_restore_exact_bytes ... ok
2026-07-29T09:53:35.2618357Z test rc::tests::status_row_marker_is_disabled_by_flag ... ok
2026-07-29T09:53:35.2619704Z test rc::tests::status_update_size_repoints_geometry ... ok
2026-07-29T09:53:35.2621395Z test rc::tests::teardown_matrix_postlude_precedes_prose_across_every_final_class ... ok
2026-07-29T09:53:35.2622761Z test rc::tests::translate_key_event_emits_exact_xterm_vt ... ok
2026-07-29T09:53:35.2623736Z test rc::tests::with_vt_output_disables_newline_auto_return ... ok
2026-07-29T09:53:35.2624755Z test rc::tests::with_vt_output_enables_virtual_terminal_processing ... ok
2026-07-29T09:53:35.4643077Z test cli::tests::spt_hosted_no_relay_detection ... ok
2026-07-29T09:53:35.5411505Z test picker::data::tests::gather_endpoints_projects_from_seeded_index_with_zero_git ... ok
2026-07-29T09:53:35.6151312Z test picker::data::tests::gather_renders_live_unbound ... ok
2026-07-29T09:53:36.0373141Z test picker::data::tests::home_subnet_options_is_mru_ordered ... ok
2026-07-29T09:53:36.0596762Z test picker::data::tests::own_node_tab_label_falls_back_to_keyprefix ... ok
2026-07-29T09:53:36.1671026Z test picker::data::tests::picker_excludes_flat_worker_and_psyche ... ok
2026-07-29T09:53:36.1884689Z test picker::data::tests::remote_picker_renders_suspended_dead_perch_offline ... ok
2026-07-29T09:53:36.1885930Z test roster::tests::match_self_by_ancestry_disambiguates_and_none ... ok
2026-07-29T09:53:36.2093653Z test picker::data::tests::remote_rows_render_full_palette_parity ... ok
2026-07-29T09:53:36.2094973Z test teardown::tests::an_unconfirmed_row_over_a_dead_root_is_stale_not_a_survivor ... ok
2026-07-29T09:53:36.2252545Z test picker::data::tests::resume_rows_title_from_index_cwd_map_with_pure_fallback ... ok
2026-07-29T09:53:36.2259185Z test teardown::tests::timeout_refuses_the_stamp_and_names_the_survivor ... ok
2026-07-29T09:53:36.2262091Z test teardown::tests::topology_gate_is_controllable_true_only ... ok
2026-07-29T09:53:36.2264162Z test tests::broken_pipe_panic_classifier ... ok
2026-07-29T09:53:36.2272200Z test wansend::tests::bare_id_resolves_across_remote_snapshot ... ok
2026-07-29T09:53:36.2278337Z test wansend::tests::classify_wan_reply_only_delivers_on_positive_outcomes ... ok
2026-07-29T09:53:36.2388926Z test wansend::tests::load_snapshots_degrades_on_junk ... ok
2026-07-29T09:53:36.2391465Z test wansend::tests::refusals_render_copy_paste_targets ... ok
2026-07-29T09:53:36.2433191Z test teardown::tests::liveness_proof_needs_a_real_snapshot_and_finds_this_process ... ok
2026-07-29T09:53:36.2455726Z test picker::data::tests::shared_machine_is_one_group_with_unioned_subnets ... ok
2026-07-29T09:53:36.2657712Z test rc::tests::attach_against_stopped_daemon_never_spawns_and_exits_loud ... ok
2026-07-29T09:53:36.3096157Z test rc::tests::attach_offline_endpoint_short_circuits_clean ... ok
2026-07-29T09:53:36.3250778Z 
2026-07-29T09:53:36.3250969Z running 1 test
2026-07-29T09:53:36.3578133Z NTP_TOTP_UNCORRECTED: all NTP servers unreachable — ceremony clock = raw system clock
2026-07-29T09:53:36.3699213Z CONN_LIFECYCLE: conn=1 role=brain wall_ms=1785318816369 mono_ms=0 event=transport-close poisoned=false timed_out=false [REQ-CONN-POISON-ATTRIBUTION]
2026-07-29T09:53:36.3700698Z CONN_LIFECYCLE: conn=3 role=brain wall_ms=1785318816370 mono_ms=0 event=write-start [REQ-CONN-POISON-ATTRIBUTION]
2026-07-29T09:53:36.4490381Z CONN_LIFECYCLE: conn=2 role=brain controller session=1 endpoint=reheal by=local wall_ms=1785318816448 mono_ms=79 event=controller-attach session=1 from_seq=0 [REQ-CONN-POISON-ATTRIBUTION]
2026-07-29T09:53:36.4500536Z CONN_LIFECYCLE: conn=2 role=brain controller session=1 endpoint=reheal by=local wall_ms=1785318816449 mono_ms=79 event=write-start [REQ-CONN-POISON-ATTRIBUTION]
2026-07-29T09:53:36.4510970Z CONN_LIFECYCLE: conn=4 role=brain wall_ms=1785318816450 mono_ms=81 event=write-start [REQ-CONN-POISON-ATTRIBUTION]
2026-07-29T09:53:36.4659942Z CONN_LIFECYCLE: conn=4 role=brain stream-subscriber stream=2 wall_ms=1785318816465 mono_ms=95 event=stream-sub-attach stream=2 from_seq=0 [REQ-CONN-POISON-ATTRIBUTION]
2026-07-29T09:53:36.4715014Z CONN_LIFECYCLE: conn=5 role=brain wall_ms=1785318816471 mono_ms=101 event=write-start [REQ-CONN-POISON-ATTRIBUTION]
2026-07-29T09:53:36.4716738Z CONN_LIFECYCLE: conn=5 role=brain wall_ms=1785318816471 mono_ms=101 event=transport-close poisoned=false timed_out=false [REQ-CONN-POISON-ATTRIBUTION]
2026-07-29T09:53:36.4721381Z CONN_LIFECYCLE: conn=6 role=brain wall_ms=1785318816472 mono_ms=102 event=write-start [REQ-CONN-POISON-ATTRIBUTION]
2026-07-29T09:53:36.4723889Z CONN_LIFECYCLE: conn=6 role=brain stream-subscriber stream=1 wall_ms=1785318816472 mono_ms=102 event=stream-sub-attach stream=1 from_seq=0 [REQ-CONN-POISON-ATTRIBUTION]
2026-07-29T09:53:36.4726892Z CONN_LIFECYCLE: conn=6 role=brain stream-subscriber stream=1 viewer session=1 endpoint=reheal vid=0 wall_ms=1785318816472 mono_ms=102 event=viewer-attach session=1 vid=0 from_seq=0 [REQ-CONN-POISON-ATTRIBUTION]
2026-07-29T09:53:36.4733661Z SUBSCRIBE_DECISION: session=1 endpoint=reheal by=fd1724385aa0c75b64fb78cd602fa1d991fdebf76b13c58ed702eac835e9f618 conn=6 intent=viewer old_by=- old_gen=0 req_gen=0 decision=viewer
2026-07-29T09:53:36.4735776Z CONN_LIFECYCLE: conn=6 role=brain stream-subscriber stream=1 viewer session=1 endpoint=reheal vid=0 viewer session=1 endpoint=reheal vid=1 wall_ms=1785318816472 mono_ms=103 event=viewer-attach session=1 vid=1 from_seq=0 [REQ-CONN-POISON-ATTRIBUTION]
2026-07-29T09:53:36.4737108Z SUBSCRIBE_DECISION: session=1 endpoint=reheal by=fd1724385aa0c75b64fb78cd602fa1d991fdebf76b13c58ed702eac835e9f618 conn=6 intent=viewer old_by=- old_gen=0 req_gen=0 decision=viewer
2026-07-29T09:53:36.6134360Z 
2026-07-29T09:53:36.6134904Z running 1 test
2026-07-29T09:53:36.6471227Z NTP_TOTP_UNCORRECTED: all NTP servers unreachable — ceremony clock = raw system clock
2026-07-29T09:53:36.6895808Z CONN_LIFECYCLE: conn=1 role=brain wall_ms=1785318816689 mono_ms=0 event=transport-close poisoned=false timed_out=false [REQ-CONN-POISON-ATTRIBUTION]
2026-07-29T09:53:36.6898282Z CONN_LIFECYCLE: conn=3 role=brain wall_ms=1785318816689 mono_ms=0 event=write-start [REQ-CONN-POISON-ATTRIBUTION]
2026-07-29T09:53:36.7226563Z CONN_LIFECYCLE: conn=2 role=brain controller session=1 endpoint=reheal by=local wall_ms=1785318816721 mono_ms=32 event=controller-attach session=1 from_seq=0 [REQ-CONN-POISON-ATTRIBUTION]
2026-07-29T09:53:36.7228650Z CONN_LIFECYCLE: conn=2 role=brain controller session=1 endpoint=reheal by=local wall_ms=1785318816722 mono_ms=32 event=write-start [REQ-CONN-POISON-ATTRIBUTION]
2026-07-29T09:53:37.5043121Z CONN_LIFECYCLE: conn=4 role=brain wall_ms=1785318817504 mono_ms=814 event=write-start [REQ-CONN-POISON-ATTRIBUTION]
2026-07-29T09:53:37.5186275Z CONN_LIFECYCLE: conn=4 role=brain stream-subscriber stream=2 wall_ms=1785318817518 mono_ms=828 event=stream-sub-attach stream=2 from_seq=0 [REQ-CONN-POISON-ATTRIBUTION]
2026-07-29T09:53:37.5472452Z CONN_LIFECYCLE: conn=5 role=brain wall_ms=1785318817547 mono_ms=857 event=write-start [REQ-CONN-POISON-ATTRIBUTION]
2026-07-29T09:53:37.5473379Z CONN_LIFECYCLE: conn=5 role=brain wall_ms=1785318817547 mono_ms=857 event=transport-close poisoned=false timed_out=false [REQ-CONN-POISON-ATTRIBUTION]
2026-07-29T09:53:37.5476388Z CONN_LIFECYCLE: conn=6 role=brain wall_ms=1785318817547 mono_ms=858 event=write-start [REQ-CONN-POISON-ATTRIBUTION]
2026-07-29T09:53:37.5478087Z CONN_LIFECYCLE: conn=6 role=brain stream-subscriber stream=1 wall_ms=1785318817547 mono_ms=858 event=stream-sub-attach stream=1 from_seq=0 [REQ-CONN-POISON-ATTRIBUTION]
2026-07-29T09:53:37.5479908Z CONN_LIFECYCLE: conn=6 role=brain stream-subscriber stream=1 viewer session=1 endpoint=reheal vid=0 wall_ms=1785318817547 mono_ms=858 event=viewer-attach session=1 vid=0 from_seq=0 [REQ-CONN-POISON-ATTRIBUTION]
2026-07-29T09:53:37.5482302Z SUBSCRIBE_DECISION: session=1 endpoint=reheal by=fd1724385aa0c75b64fb78cd602fa1d991fdebf76b13c58ed702eac835e9f618 conn=6 intent=viewer old_by=- old_gen=0 req_gen=0 decision=viewer
2026-07-29T09:53:37.5483400Z CONN_LIFECYCLE: conn=6 role=brain stream-subscriber stream=1 viewer session=1 endpoint=reheal vid=0 viewer session=1 endpoint=reheal vid=1 wall_ms=1785318817548 mono_ms=858 event=viewer-attach session=1 vid=1 from_seq=0 [REQ-CONN-POISON-ATTRIBUTION]
2026-07-29T09:53:37.5485073Z SUBSCRIBE_DECISION: session=1 endpoint=reheal by=fd1724385aa0c75b64fb78cd602fa1d991fdebf76b13c58ed702eac835e9f618 conn=6 intent=viewer old_by=- old_gen=0 req_gen=0 decision=viewer
2026-07-29T09:53:37.8834519Z CONN_LIFECYCLE: conn=6 role=brain stream-subscriber stream=1 viewer session=1 endpoint=reheal vid=0 viewer session=1 endpoint=reheal vid=1 wall_ms=1785318817883 mono_ms=1193 event=stream-sub-release stream=1 [REQ-CONN-POISON-ATTRIBUTION]
2026-07-29T09:53:37.8835987Z CONN_LIFECYCLE: conn=7 role=brain wall_ms=1785318817883 mono_ms=1193 event=transport-close poisoned=false timed_out=false [REQ-CONN-POISON-ATTRIBUTION]
2026-07-29T09:53:37.8958405Z test rc::tests::attach_viewport_reconnects_across_a_broker_bounce ... ok
2026-07-29T09:53:39.2224761Z test rc::tests::establish_attach_reuses_the_probes_carried_pump_conn ... ok
2026-07-29T09:53:41.5463566Z test rc::tests::qualified_targets_attach_with_bare_wire_id ... ok
2026-07-29T09:53:41.5669334Z test roster::tests::detect_self_by_ancestry_none_when_no_ancestor_owns_a_perch ... ok
2026-07-29T09:53:41.5940281Z test roster::tests::detect_self_by_ancestry_resolves_a_live_ancestor_perch ... ok
2026-07-29T09:53:41.6104167Z test roster::tests::detect_self_id_endpoint_id_leg_is_label_only_and_perch_gated ... ok
2026-07-29T09:53:41.6515586Z test roster::tests::detect_self_id_resolves_identity_with_zero_git_spawns ... ok
2026-07-29T09:53:41.6765553Z test roster::tests::detect_self_resolves_spt_hosted_perch_via_parent_pid ... ok
2026-07-29T09:53:41.6790457Z test roster::tests::enumerate_yields_offline_corrupt_row_for_unparseable_info ... ok
2026-07-29T09:53:41.7173486Z test roster::tests::list_all_perch_dirs_enumerates_nested_psyche_for_self_resolution ... ok
2026-07-29T09:53:41.7460356Z test roster::tests::parent_pid_candidates_stay_ancestry_gated ... ok
2026-07-29T09:53:42.1893285Z test wansend::tests::remote_rest_suspends_and_wakes_with_the_deferred_gate ... ok
2026-07-29T09:53:42.2677303Z test wansend::tests::resolve_and_dial_owner_dials_the_resolved_node ... ok
2026-07-29T09:53:42.3200126Z test wansend::tests::resolve_and_dial_owner_is_honest_on_resolution_misses ... ok
2026-07-29T09:53:42.3339267Z test wansend::tests::seed_first_addr_prefers_the_cached_direct_address ... ok
2026-07-29T09:53:42.5799097Z test wansend::tests::wan_send_ships_to_the_resolved_node ... ok
2026-07-29T09:53:42.5799399Z 
2026-07-29T09:53:42.5799681Z failures:
2026-07-29T09:53:42.5799780Z 
2026-07-29T09:53:42.5799970Z ---- cli::tests::adapter_translate_proof_gates_on_commit stdout ----
2026-07-29T09:53:42.5800275Z 
2026-07-29T09:53:42.5804363Z thread 'cli::tests::adapter_translate_proof_gates_on_commit' (21380) panicked at crates\spt\src\cli.rs:17011:13:
2026-07-29T09:53:42.5805004Z translate_proof_fixture must be built: C:\actions-runner\_work\spt-bs-core\spt-bs-core\target\debug\translate_proof_fixture.exe (run via `cargo test -p spt`)
2026-07-29T09:53:42.5805835Z note: run with `RUST_BACKTRACE=1` environment variable to display a backtrace
2026-07-29T09:53:42.5806031Z 
2026-07-29T09:53:42.5806034Z 
2026-07-29T09:53:42.5806079Z failures:
2026-07-29T09:53:42.5806238Z     cli::tests::adapter_translate_proof_gates_on_commit
2026-07-29T09:53:42.5806619Z 
2026-07-29T09:53:42.5806919Z test result: FAILED. 456 passed; 1 failed; 0 ignored; 0 measured; 0 filtered out; finished in 53.63s
2026-07-29T09:53:42.5807321Z 
2026-07-29T09:53:42.6035345Z error: test failed, to rerun pass `-p spt --bin spt`
2026-07-29T09:53:42.6873837Z ##[error]Process completed with exit code 1.
2026-07-29T09:53:42.7907506Z Post job cleanup.
2026-07-29T09:53:43.0429678Z [command]"C:\Program Files\Git\cmd\git.exe" version
2026-07-29T09:53:43.1292085Z git version 2.43.0.windows.1
2026-07-29T09:53:43.1351095Z Copying 'C:\Users\decid\.gitconfig' to 'C:\actions-runner\_work\_temp\d0fd690d-8596-43df-8e3d-8a30a5cf5153\.gitconfig'
2026-07-29T09:53:43.1461696Z Temporarily overriding HOME='C:\actions-runner\_work\_temp\d0fd690d-8596-43df-8e3d-8a30a5cf5153' before making global git config changes
2026-07-29T09:53:43.1462490Z Adding repository directory to the temporary git global config as a safe directory
2026-07-29T09:53:43.1471350Z [command]"C:\Program Files\Git\cmd\git.exe" config --global --add safe.directory C:\actions-runner\_work\spt-bs-core\spt-bs-core
2026-07-29T09:53:43.2673026Z [command]"C:\Program Files\Git\cmd\git.exe" config --local --name-only --get-regexp core\.sshCommand
2026-07-29T09:53:43.3984831Z [command]"C:\Program Files\Git\cmd\git.exe" submodule foreach --recursive "sh -c \"git config --local --name-only --get-regexp 'core\.sshCommand' && git config --local --unset-all 'core.sshCommand' || :\""
2026-07-29T09:53:45.9089607Z [command]"C:\Program Files\Git\cmd\git.exe" config --local --name-only --get-regexp http\.https\:\/\/github\.com\/\.extraheader
2026-07-29T09:53:46.0223164Z http.https://github.com/.extraheader
2026-07-29T09:53:46.0254187Z [command]"C:\Program Files\Git\cmd\git.exe" config --local --unset-all http.https://github.com/.extraheader
2026-07-29T09:53:46.0705723Z [command]"C:\Program Files\Git\cmd\git.exe" submodule foreach --recursive "sh -c \"git config --local --name-only --get-regexp 'http\.https\:\/\/github\.com\/\.extraheader' && git config --local --unset-all 'http.https://github.com/.extraheader' || :\""
2026-07-29T09:53:48.5376320Z [command]"C:\Program Files\Git\cmd\git.exe" config --local --name-only --get-regexp ^includeIf\.gitdir:
2026-07-29T09:53:48.5854917Z [command]"C:\Program Files\Git\cmd\git.exe" submodule foreach --recursive "git config --local --show-origin --name-only --get-regexp remote.origin.url"
2026-07-29T09:53:49.6283789Z Cleaning up orphan processes
